BDBM307510 US10150740, Example 6
SMILES: COCCCOc1cc2CN(CC(C)C)n3cc(C(O)=O)c(=O)cc3-c2cc1OC
InChI Key: InChIKey=WMHXWLQJSKIYBR-UHFFFAOYSA-N
Data: 1 IC50
Activity Spreadsheet -- Enzyme Inhibition Constant Data from BindingDB
Found 1 hit for monomerid = 307510
Trg + Lig
Ki
nM
ΔG°
kcal/mole
IC50
nM
Kd
nM
EC50/IC50
nM
koff
s-1
kon
M-1s-1
pHTemp
°C
Hepatitis C virus polyprotein
(Hepatitis C virus (HCV))
BDBM307510
(US10150740, Example 6)
Show SMILES COCCCOc1cc2CN(CC(C)C)n3cc(C(O)=O)c(=O)cc3-c2cc1OC
Show InChI InChI=1S/C22H28N2O6/c1-14(2)11-23-12-15-8-21(30-7-5-6-28-3)20(29-4)9-16(15)18-10-19(25)17(22(26)27)13-24(18)23/h8-10,13-14H,5-7,11-12H2,1-4H3,(H,26,27)
US Patent
n/an/a 53n/an/an/an/an/an/a
Hoffmann-La Roche Inc.
US Patent
Assay Description
HepG2.2.15 cells (Acs et al. Proc Natl Acad Sci USA, 84, (1987), 4641-4), a constitutively HBV-expressing cell line were cultured in DMEM+Glutamax-I ...
US Patent US10150740 (2018)
BindingDB Entry DOI: 10.7270/Q2RN39WH