BDBM307551 5-(3-((2-(1,2,4-oxadiazol-3-yl)propan-2-yl)carbamoyl)-4-methoxyphenyl)-2-(4-fluorophenyl)-N-methyl-6-(2,2,2-trifluoroethoxy)benzofuran-3-carboxamide::US10150747, Example 18
SMILES: CNC(=O)c1c(oc2cc(OCC(F)(F)F)c(cc12)-c1ccc(OC)c(c1)C(=O)NC(C)(C)c1ncon1)-c1ccc(F)cc1
InChI Key: InChIKey=VFSZONDNCFWGJS-UHFFFAOYSA-N
Data: 1 IC50  1 EC50
Activity Spreadsheet -- Enzyme Inhibition Constant Data from BindingDB
Found 2 hits for monomerid = 307551
Trg + Lig
Ki
nM
ΔG°
kcal/mole
IC50
nM
Kd
nM
EC50/IC50
nM
koff
s-1
kon
M-1s-1
pHTemp
°C
RNA polymerase (NS5B)
(Hepatitis C virus (HCV))
BDBM307551
(5-(3-((2-(1,2,4-oxadiazol-3-yl)propan-2-yl)carbamo...)
Show SMILES CNC(=O)c1c(oc2cc(OCC(F)(F)F)c(cc12)-c1ccc(OC)c(c1)C(=O)NC(C)(C)c1ncon1)-c1ccc(F)cc1
Show InChI InChI=1S/C31H26F4N4O6/c1-30(2,29-37-15-44-39-29)38-27(40)21-11-17(7-10-22(21)42-4)19-12-20-24(13-23(19)43-14-31(33,34)35)45-26(25(20)28(41)36-3)16-5-8-18(32)9-6-16/h5-13,15H,14H2,1-4H3,(H,36,41)(H,38,40)
US Patent
n/an/an/an/a 2.85n/an/an/an/a
Bristol-Myers Squibb Company
US Patent
Assay Description
To evaluate compound efficacy, titrated compounds were transferred to sterile 384-well tissue culture treated plates, and the plates were seeded with...
US Patent US10150747 (2018)
BindingDB Entry DOI: 10.7270/Q2H70HWJ
RNA polymerase (NS5B)
(Hepatitis C virus (HCV))
BDBM307551
(5-(3-((2-(1,2,4-oxadiazol-3-yl)propan-2-yl)carbamo...)
Show SMILES CNC(=O)c1c(oc2cc(OCC(F)(F)F)c(cc12)-c1ccc(OC)c(c1)C(=O)NC(C)(C)c1ncon1)-c1ccc(F)cc1
Show InChI InChI=1S/C31H26F4N4O6/c1-30(2,29-37-15-44-39-29)38-27(40)21-11-17(7-10-22(21)42-4)19-12-20-24(13-23(19)43-14-31(33,34)35)45-26(25(20)28(41)36-3)16-5-8-18(32)9-6-16/h5-13,15H,14H2,1-4H3,(H,36,41)(H,38,40)
US Patent
n/an/a 2.83n/an/an/an/an/an/a
Bristol-Myers Squibb Company
US Patent
Assay Description
To evaluate compound efficacy, titrated compounds were transferred to sterile 384-well tissue culture treated plates, and the plates were seeded with...
US Patent US10150747 (2018)
BindingDB Entry DOI: 10.7270/Q2H70HWJ