BDBM3076 2-aminopyrido[2,3-d]pyrimidin-7(8H)-one 43::6-(2,6-dichlorophenyl)-8-ethyl-2-(pyridin-4-ylamino)-7H,8H-pyrido[2,3-d]pyrimidin-7-one
SMILES: CCn1c2nc(Nc3ccncc3)ncc2cc(-c2c(Cl)cccc2Cl)c1=O
InChI Key: InChIKey=DAZNPHVDUSTLGK-UHFFFAOYSA-N
Data: 4 IC50
Activity Spreadsheet -- Enzyme Inhibition Constant Data from BindingDB
Found 4 hits for monomerid = 3076
Trg + Lig
Ki
nM
ΔG°
kcal/mole
IC50
nM
Kd
nM
EC50/IC50
nM
koff
s-1
kon
M-1s-1
pHTemp
°C
Platelet-derived growth factor receptor beta
(Homo sapiens (Human))
BDBM3076
(2-aminopyrido[2,3-d]pyrimidin-7(8H)-one 43 | 6-(2,...)
Show SMILES CCn1c2nc(Nc3ccncc3)ncc2cc(-c2c(Cl)cccc2Cl)c1=O |(-1.73,-3.06,;-2.82,-1.97,;-2.82,-.43,;-4.15,.34,;-5.48,-.43,;-6.82,.34,;-8.15,-.43,;-8.15,-1.97,;-6.82,-2.74,;-6.82,-4.28,;-8.15,-5.05,;-9.48,-4.28,;-9.48,-2.74,;-6.82,1.88,;-5.48,2.65,;-4.15,1.88,;-2.82,2.65,;-1.48,1.88,;-.15,2.65,;-.15,4.19,;-1.48,4.96,;1.18,4.96,;2.52,4.19,;2.52,2.65,;1.18,1.88,;1.18,.34,;-1.48,.34,;-.15,-.43,)|
Show InChI InChI=1S/C20H15Cl2N5O/c1-2-27-18-12(11-24-20(26-18)25-13-6-8-23-9-7-13)10-14(19(27)28)17-15(21)4-3-5-16(17)22/h3-11H,2H2,1H3,(H,23,24,25,26)
NCI pathway
Reactome pathway
n/an/a 100n/an/an/an/an/an/a
Parke-Davis Pharmaceutical Research
Assay Description
IC50 is the inhibitor concentration which inhibits 50% of kinase activity that catalyzes the transfer of the terminal phosphate from [gamma-32P] labe...
J Med Chem 41: 3276-92 (1998)
Article DOI: 10.1021/jm9802259
BindingDB Entry DOI: 10.7270/Q27P8WK3
Epidermal growth factor receptor
(Homo sapiens (Human))
BDBM3076
(2-aminopyrido[2,3-d]pyrimidin-7(8H)-one 43 | 6-(2,...)
Show SMILES CCn1c2nc(Nc3ccncc3)ncc2cc(-c2c(Cl)cccc2Cl)c1=O |(-1.73,-3.06,;-2.82,-1.97,;-2.82,-.43,;-4.15,.34,;-5.48,-.43,;-6.82,.34,;-8.15,-.43,;-8.15,-1.97,;-6.82,-2.74,;-6.82,-4.28,;-8.15,-5.05,;-9.48,-4.28,;-9.48,-2.74,;-6.82,1.88,;-5.48,2.65,;-4.15,1.88,;-2.82,2.65,;-1.48,1.88,;-.15,2.65,;-.15,4.19,;-1.48,4.96,;1.18,4.96,;2.52,4.19,;2.52,2.65,;1.18,1.88,;1.18,.34,;-1.48,.34,;-.15,-.43,)|
Show InChI InChI=1S/C20H15Cl2N5O/c1-2-27-18-12(11-24-20(26-18)25-13-6-8-23-9-7-13)10-14(19(27)28)17-15(21)4-3-5-16(17)22/h3-11H,2H2,1H3,(H,23,24,25,26)
n/an/a 490n/an/an/an/an/an/a
Parke-Davis Pharmaceutical Research
Assay Description
IC50 is the inhibitor concentration which inhibits 50% of kinase activity that catalyzes the transfer of the terminal phosphate from [gamma-32P] labe...
J Med Chem 41: 3276-92 (1998)
Article DOI: 10.1021/jm9802259
BindingDB Entry DOI: 10.7270/Q27P8WK3
Proto-oncogene tyrosine-protein kinase Src
(Homo sapiens (Human))
BDBM3076
(2-aminopyrido[2,3-d]pyrimidin-7(8H)-one 43 | 6-(2,...)
Show SMILES CCn1c2nc(Nc3ccncc3)ncc2cc(-c2c(Cl)cccc2Cl)c1=O |(-1.73,-3.06,;-2.82,-1.97,;-2.82,-.43,;-4.15,.34,;-5.48,-.43,;-6.82,.34,;-8.15,-.43,;-8.15,-1.97,;-6.82,-2.74,;-6.82,-4.28,;-8.15,-5.05,;-9.48,-4.28,;-9.48,-2.74,;-6.82,1.88,;-5.48,2.65,;-4.15,1.88,;-2.82,2.65,;-1.48,1.88,;-.15,2.65,;-.15,4.19,;-1.48,4.96,;1.18,4.96,;2.52,4.19,;2.52,2.65,;1.18,1.88,;1.18,.34,;-1.48,.34,;-.15,-.43,)|
Show InChI InChI=1S/C20H15Cl2N5O/c1-2-27-18-12(11-24-20(26-18)25-13-6-8-23-9-7-13)10-14(19(27)28)17-15(21)4-3-5-16(17)22/h3-11H,2H2,1H3,(H,23,24,25,26)
n/an/a 12n/an/an/an/an/an/a
Parke-Davis Pharmaceutical Research
Assay Description
IC50 is the inhibitor concentration which inhibits 50% of kinase activity that catalyzes the transfer of the terminal phosphate from [gamma-32P] labe...
J Med Chem 41: 3276-92 (1998)
Article DOI: 10.1021/jm9802259
BindingDB Entry DOI: 10.7270/Q27P8WK3
Fibroblast growth factor receptor 1
(Homo sapiens (Human))
BDBM3076
(2-aminopyrido[2,3-d]pyrimidin-7(8H)-one 43 | 6-(2,...)
Show SMILES CCn1c2nc(Nc3ccncc3)ncc2cc(-c2c(Cl)cccc2Cl)c1=O |(-1.73,-3.06,;-2.82,-1.97,;-2.82,-.43,;-4.15,.34,;-5.48,-.43,;-6.82,.34,;-8.15,-.43,;-8.15,-1.97,;-6.82,-2.74,;-6.82,-4.28,;-8.15,-5.05,;-9.48,-4.28,;-9.48,-2.74,;-6.82,1.88,;-5.48,2.65,;-4.15,1.88,;-2.82,2.65,;-1.48,1.88,;-.15,2.65,;-.15,4.19,;-1.48,4.96,;1.18,4.96,;2.52,4.19,;2.52,2.65,;1.18,1.88,;1.18,.34,;-1.48,.34,;-.15,-.43,)|
Show InChI InChI=1S/C20H15Cl2N5O/c1-2-27-18-12(11-24-20(26-18)25-13-6-8-23-9-7-13)10-14(19(27)28)17-15(21)4-3-5-16(17)22/h3-11H,2H2,1H3,(H,23,24,25,26)
NCI pathway
Reactome pathway
n/an/a 110n/an/an/an/an/an/a
Parke-Davis Pharmaceutical Research
Assay Description
IC50 is the inhibitor concentration which inhibits 50% of kinase activity that catalyzes the transfer of the terminal phosphate from [gamma-32P] labe...
J Med Chem 41: 3276-92 (1998)
Article DOI: 10.1021/jm9802259
BindingDB Entry DOI: 10.7270/Q27P8WK3