null
SMILES: O=C(NC1CCOCC1)c1ccc2C(=O)N(Cc2c1)c1cccc(n1)-c1nncn1C1CC1
InChI Key: InChIKey=QARGSYPBKUGBHZ-UHFFFAOYSA-N
Activity Spreadsheet -- Enzyme Inhibition Constant Data from BindingDB
Found 2 hits for monomerid = 307617
Trg + Lig
Ki
nM
ΔG°
kcal/mole
IC50
nM
Kd
nM
EC50/IC50
nM
koff
s-1
kon
M-1s-1
pHTemp
°C
Mitogen-activated protein kinase kinase kinase 5
(Homo sapiens (Human))
BDBM307617
(2-(6-(4-cyclopropyl- 4H-1,2,4-triazol-3- yl)pyridi...)
Show SMILES O=C(NC1CCOCC1)c1ccc2C(=O)N(Cc2c1)c1cccc(n1)-c1nncn1C1CC1
Show InChI InChI=1S/C24H24N6O3/c31-23(26-17-8-10-33-11-9-17)15-4-7-19-16(12-15)13-29(24(19)32)21-3-1-2-20(27-21)22-28-25-14-30(22)18-5-6-18/h1-4,7,12,14,17-18H,5-6,8-11,13H2,(H,26,31)
US Patent
<200n/an/an/an/an/an/an/an/a
SEAL ROCK THERAPEUTICS, INC.
US Patent
Assay Description
The ASK1 enzymatic assay was run following Promega ASK1 Kinase Enzyme System (Cat #V3881). The kit provides the protocol, enzymes and all reagents ne...
US Patent US10150755 (2018)
BindingDB Entry DOI: 10.7270/Q2125VQ8
Mitogen-activated protein kinase kinase kinase 5
(Homo sapiens (Human))
BDBM307617
(2-(6-(4-cyclopropyl- 4H-1,2,4-triazol-3- yl)pyridi...)
Show SMILES O=C(NC1CCOCC1)c1ccc2C(=O)N(Cc2c1)c1cccc(n1)-c1nncn1C1CC1
Show InChI InChI=1S/C24H24N6O3/c31-23(26-17-8-10-33-11-9-17)15-4-7-19-16(12-15)13-29(24(19)32)21-3-1-2-20(27-21)22-28-25-14-30(22)18-5-6-18/h1-4,7,12,14,17-18H,5-6,8-11,13H2,(H,26,31)
US Patent
n/an/a<200n/an/an/an/an/an/a
SEAL ROCK THERAPEUTICS, INC.
US Patent
Assay Description
The ASK1 enzymatic assay was run following Promega ASK1 Kinase Enzyme System (Cat #V3881). The kit provides the protocol, enzymes and all reagents ne...
US Patent US10150755 (2018)
BindingDB Entry DOI: 10.7270/Q27P91GS