BDBM307658 2-(6-(4-cyclopropyl- 4H-1,2,4-triazol-3- yl)pyridin-2-yl)-6- (pyridin-4- yl)isoindolin-1-one::US10150755, Compound 50
SMILES: O=C1N(Cc2ccc(cc12)-c1ccncc1)c1cccc(n1)-c1nncn1C1CC1
InChI Key: InChIKey=GJQZLSTUXBSYKO-UHFFFAOYSA-N
Data: 1 KI  1 IC50
Activity Spreadsheet -- Enzyme Inhibition Constant Data from BindingDB
Found 2 hits for monomerid = 307658
Trg + Lig
Ki
nM
ΔG°
kcal/mole
IC50
nM
Kd
nM
EC50/IC50
nM
koff
s-1
kon
M-1s-1
pHTemp
°C
Mitogen-activated protein kinase kinase kinase 5
(Homo sapiens (Human))
BDBM307658
(2-(6-(4-cyclopropyl- 4H-1,2,4-triazol-3- yl)pyridi...)
Show SMILES O=C1N(Cc2ccc(cc12)-c1ccncc1)c1cccc(n1)-c1nncn1C1CC1
Show InChI InChI=1S/C23H18N6O/c30-23-19-12-16(15-8-10-24-11-9-15)4-5-17(19)13-28(23)21-3-1-2-20(26-21)22-27-25-14-29(22)18-6-7-18/h1-5,8-12,14,18H,6-7,13H2
US Patent
<200n/an/an/an/an/an/an/an/a
SEAL ROCK THERAPEUTICS, INC.
US Patent
Assay Description
The ASK1 enzymatic assay was run following Promega ASK1 Kinase Enzyme System (Cat #V3881). The kit provides the protocol, enzymes and all reagents ne...
US Patent US10150755 (2018)
BindingDB Entry DOI: 10.7270/Q2125VQ8
Mitogen-activated protein kinase kinase kinase 5
(Homo sapiens (Human))
BDBM307658
(2-(6-(4-cyclopropyl- 4H-1,2,4-triazol-3- yl)pyridi...)
Show SMILES O=C1N(Cc2ccc(cc12)-c1ccncc1)c1cccc(n1)-c1nncn1C1CC1
Show InChI InChI=1S/C23H18N6O/c30-23-19-12-16(15-8-10-24-11-9-15)4-5-17(19)13-28(23)21-3-1-2-20(26-21)22-27-25-14-29(22)18-6-7-18/h1-5,8-12,14,18H,6-7,13H2
US Patent
n/an/a<200n/an/an/an/an/an/a
SEAL ROCK THERAPEUTICS, INC.
US Patent
Assay Description
The ASK1 enzymatic assay was run following Promega ASK1 Kinase Enzyme System (Cat #V3881). The kit provides the protocol, enzymes and all reagents ne...
US Patent US10150755 (2018)
BindingDB Entry DOI: 10.7270/Q27P91GS