BDBM307678 2-(6-(4-cyclopropyl-4H-1,2,4-triazol-3-yl)pyridin-2-yl)-5-isopropoxy-6-(pyridin-3-yl)isoindolin-1-one ::US10150755, Compound 70
SMILES: COC(=O)c1cc2CN(C(=O)c2cc1-c1cccnc1)c1cccc(n1)-c1nncn1C1CC1
InChI Key: InChIKey=MFRSEADFDRBTHI-UHFFFAOYSA-N
Data: 1 KI  1 IC50
Activity Spreadsheet -- Enzyme Inhibition Constant Data from BindingDB
Found 2 hits for monomerid = 307678
Trg + Lig
Ki
nM
ΔG°
kcal/mole
IC50
nM
Kd
nM
EC50/IC50
nM
koff
s-1
kon
M-1s-1
pHTemp
°C
Mitogen-activated protein kinase kinase kinase 5
(Homo sapiens (Human))
BDBM307678
(2-(6-(4-cyclopropyl-4H-1,2,4-triazol-3-yl)pyridin-...)
Show SMILES COC(=O)c1cc2CN(C(=O)c2cc1-c1cccnc1)c1cccc(n1)-c1nncn1C1CC1
Show InChI InChI=1S/C25H20N6O3/c1-34-25(33)20-10-16-13-30(24(32)19(16)11-18(20)15-4-3-9-26-12-15)22-6-2-5-21(28-22)23-29-27-14-31(23)17-7-8-17/h2-6,9-12,14,17H,7-8,13H2,1H3
US Patent
<200n/an/an/an/an/an/an/an/a
SEAL ROCK THERAPEUTICS, INC.
US Patent
Assay Description
The ASK1 enzymatic assay was run following Promega ASK1 Kinase Enzyme System (Cat #V3881). The kit provides the protocol, enzymes and all reagents ne...
US Patent US10150755 (2018)
BindingDB Entry DOI: 10.7270/Q2125VQ8
Mitogen-activated protein kinase kinase kinase 5
(Homo sapiens (Human))
BDBM307678
(2-(6-(4-cyclopropyl-4H-1,2,4-triazol-3-yl)pyridin-...)
Show SMILES COC(=O)c1cc2CN(C(=O)c2cc1-c1cccnc1)c1cccc(n1)-c1nncn1C1CC1
Show InChI InChI=1S/C25H20N6O3/c1-34-25(33)20-10-16-13-30(24(32)19(16)11-18(20)15-4-3-9-26-12-15)22-6-2-5-21(28-22)23-29-27-14-31(23)17-7-8-17/h2-6,9-12,14,17H,7-8,13H2,1H3
US Patent
n/an/a<200n/an/an/an/an/an/a
SEAL ROCK THERAPEUTICS, INC.
US Patent
Assay Description
The ASK1 enzymatic assay was run following Promega ASK1 Kinase Enzyme System (Cat #V3881). The kit provides the protocol, enzymes and all reagents ne...
US Patent US10150755 (2018)
BindingDB Entry DOI: 10.7270/Q27P91GS