null
SMILES: CCCCNc1ncc(c(NC2CCC(O)CC2)n1)-c1ccc(cn1)C1(CCC1)N1CCN(C)CC1
InChI Key: InChIKey=YTEDDIJNHJDCLR-UHFFFAOYSA-N
Activity Spreadsheet -- Enzyme Inhibition Constant Data from BindingDB
Found 4 hits for monomerid = 308319
Trg + Lig
Ki
nM
ΔG°
kcal/mole
IC50
nM
Kd
nM
EC50/IC50
nM
koff
s-1
kon
M-1s-1
pHTemp
°C
Tyrosine-protein kinase Mer
(Homo sapiens (Human))
BDBM308319
(US9649309, Compound UNC3669A)
Show SMILES CCCCNc1ncc(c(NC2CCC(O)CC2)n1)-c1ccc(cn1)C1(CCC1)N1CCN(C)CC1 |(-10,-3.85,;-8.67,-3.08,;-7.34,-3.85,;-6,-3.08,;-4.67,-3.85,;-3.33,-3.08,;-2,-3.85,;-.67,-3.08,;-.67,-1.54,;-2,-.77,;-2,.77,;-3.33,1.54,;-3.33,3.08,;-4.67,3.85,;-6,3.08,;-7.34,3.85,;-6,1.54,;-4.67,.77,;-3.33,-1.54,;.67,-.77,;2,-1.54,;3.33,-.77,;3.33,.77,;2,1.54,;.67,.77,;4.67,1.54,;5.76,2.63,;4.67,3.72,;3.58,2.63,;6,.77,;6,-.77,;7.34,-1.54,;8.67,-.77,;10,-1.54,;8.67,.77,;7.34,1.54,)|
Show InChI InChI=1S/C28H43N7O/c1-3-4-14-29-27-31-20-24(26(33-27)32-22-7-9-23(36)10-8-22)25-11-6-21(19-30-25)28(12-5-13-28)35-17-15-34(2)16-18-35/h6,11,19-20,22-23,36H,3-5,7-10,12-18H2,1-2H3,(H2,29,31,32,33)
Reactome pathway
US Patent
n/an/a 2n/an/an/an/an/an/a
The University of North Carolina at Chapel Hill
US Patent
Assay Description
Briefly, activity assays were performed in a 384 well, polypropylene microplate in a final volume of 50 μL of 50 mM Hepes, Ph 7.4 containing 10 ...
US Patent US9649309 (2017)
BindingDB Entry DOI: 10.7270/Q26Q209H
Receptor-type tyrosine-protein kinase FLT3
(Homo sapiens (Human))
BDBM308319
(US9649309, Compound UNC3669A)
Show SMILES CCCCNc1ncc(c(NC2CCC(O)CC2)n1)-c1ccc(cn1)C1(CCC1)N1CCN(C)CC1 |(-10,-3.85,;-8.67,-3.08,;-7.34,-3.85,;-6,-3.08,;-4.67,-3.85,;-3.33,-3.08,;-2,-3.85,;-.67,-3.08,;-.67,-1.54,;-2,-.77,;-2,.77,;-3.33,1.54,;-3.33,3.08,;-4.67,3.85,;-6,3.08,;-7.34,3.85,;-6,1.54,;-4.67,.77,;-3.33,-1.54,;.67,-.77,;2,-1.54,;3.33,-.77,;3.33,.77,;2,1.54,;.67,.77,;4.67,1.54,;5.76,2.63,;4.67,3.72,;3.58,2.63,;6,.77,;6,-.77,;7.34,-1.54,;8.67,-.77,;10,-1.54,;8.67,.77,;7.34,1.54,)|
Show InChI InChI=1S/C28H43N7O/c1-3-4-14-29-27-31-20-24(26(33-27)32-22-7-9-23(36)10-8-22)25-11-6-21(19-30-25)28(12-5-13-28)35-17-15-34(2)16-18-35/h6,11,19-20,22-23,36H,3-5,7-10,12-18H2,1-2H3,(H2,29,31,32,33)
NCI pathway
Reactome pathway
US Patent
n/an/a 7.20n/an/an/an/an/an/a
The University of North Carolina at Chapel Hill
US Patent
Assay Description
Briefly, activity assays were performed in a 384 well, polypropylene microplate in a final volume of 50 μL of 50 mM Hepes, Ph 7.4 containing 10 ...
US Patent US9649309 (2017)
BindingDB Entry DOI: 10.7270/Q26Q209H
Growth arrest-specific protein 6
(Homo sapiens (Human))
BDBM308319
(US9649309, Compound UNC3669A)
Show SMILES CCCCNc1ncc(c(NC2CCC(O)CC2)n1)-c1ccc(cn1)C1(CCC1)N1CCN(C)CC1 |(-10,-3.85,;-8.67,-3.08,;-7.34,-3.85,;-6,-3.08,;-4.67,-3.85,;-3.33,-3.08,;-2,-3.85,;-.67,-3.08,;-.67,-1.54,;-2,-.77,;-2,.77,;-3.33,1.54,;-3.33,3.08,;-4.67,3.85,;-6,3.08,;-7.34,3.85,;-6,1.54,;-4.67,.77,;-3.33,-1.54,;.67,-.77,;2,-1.54,;3.33,-.77,;3.33,.77,;2,1.54,;.67,.77,;4.67,1.54,;5.76,2.63,;4.67,3.72,;3.58,2.63,;6,.77,;6,-.77,;7.34,-1.54,;8.67,-.77,;10,-1.54,;8.67,.77,;7.34,1.54,)|
Show InChI InChI=1S/C28H43N7O/c1-3-4-14-29-27-31-20-24(26(33-27)32-22-7-9-23(36)10-8-22)25-11-6-21(19-30-25)28(12-5-13-28)35-17-15-34(2)16-18-35/h6,11,19-20,22-23,36H,3-5,7-10,12-18H2,1-2H3,(H2,29,31,32,33)
US Patent
n/an/a 7.70n/an/an/an/an/an/a
The University of North Carolina at Chapel Hill
US Patent
Assay Description
Briefly, activity assays were performed in a 384 well, polypropylene microplate in a final volume of 50 μL of 50 mM Hepes, Ph 7.4 containing 10 ...
US Patent US9649309 (2017)
BindingDB Entry DOI: 10.7270/Q26Q209H
Tyrosine-protein kinase receptor TYRO3
(Homo sapiens (Human))
BDBM308319
(US9649309, Compound UNC3669A)
Show SMILES CCCCNc1ncc(c(NC2CCC(O)CC2)n1)-c1ccc(cn1)C1(CCC1)N1CCN(C)CC1 |(-10,-3.85,;-8.67,-3.08,;-7.34,-3.85,;-6,-3.08,;-4.67,-3.85,;-3.33,-3.08,;-2,-3.85,;-.67,-3.08,;-.67,-1.54,;-2,-.77,;-2,.77,;-3.33,1.54,;-3.33,3.08,;-4.67,3.85,;-6,3.08,;-7.34,3.85,;-6,1.54,;-4.67,.77,;-3.33,-1.54,;.67,-.77,;2,-1.54,;3.33,-.77,;3.33,.77,;2,1.54,;.67,.77,;4.67,1.54,;5.76,2.63,;4.67,3.72,;3.58,2.63,;6,.77,;6,-.77,;7.34,-1.54,;8.67,-.77,;10,-1.54,;8.67,.77,;7.34,1.54,)|
Show InChI InChI=1S/C28H43N7O/c1-3-4-14-29-27-31-20-24(26(33-27)32-22-7-9-23(36)10-8-22)25-11-6-21(19-30-25)28(12-5-13-28)35-17-15-34(2)16-18-35/h6,11,19-20,22-23,36H,3-5,7-10,12-18H2,1-2H3,(H2,29,31,32,33)
US Patent
n/an/a 26n/an/an/an/an/an/a
The University of North Carolina at Chapel Hill
US Patent
Assay Description
Briefly, activity assays were performed in a 384 well, polypropylene microplate in a final volume of 50 μL of 50 mM Hepes, Ph 7.4 containing 10 ...
US Patent US9649309 (2017)
BindingDB Entry DOI: 10.7270/Q26Q209H