null
SMILES: CC(=O)N1CCN(CC1)c1ccc(CCc2ccc(CCOC(=O)NN)s2)nc1
InChI Key: InChIKey=MJABPEKUWKADQZ-UHFFFAOYSA-N
Activity Spreadsheet -- Enzyme Inhibition Constant Data from BindingDB
Found 2 hits for monomerid = 309493
Trg + Lig
Ki
nM
ΔG°
kcal/mole
IC50
nM
Kd
nM
EC50/IC50
nM
koff
s-1
kon
M-1s-1
pHTemp
°C
Membrane primary amine oxidase
(Rattus norvegicus (Rat))
BDBM309493
(US9603833, Example 115)
Show SMILES CC(=O)N1CCN(CC1)c1ccc(CCc2ccc(CCOC(=O)NN)s2)nc1 |$;;;;;;;;;;;;;;;;;;;;;;;;HN;;;;$|
Show InChI InChI=1S/C20H27N5O3S/c1-15(26)24-9-11-25(12-10-24)17-4-2-16(22-14-17)3-5-18-6-7-19(29-18)8-13-28-20(27)23-21/h2,4,6-7,14H,3,5,8-13,21H2,1H3,(H,23,27)
US Patent
n/an/a 10.1n/an/an/an/an/an/a
R-Tech Ueno, Ltd.
US Patent
Assay Description
The compounds of the present invention obtained in Production Examples were examined for the inhibitory effect on human and rat VAP-1 enzyme (SSAO) b...
US Patent US9603833 (2017)
BindingDB Entry DOI: 10.7270/Q2W37ZCW
Membrane primary amine oxidase
(Homo sapiens (Human))
BDBM309493
(US9603833, Example 115)
Show SMILES CC(=O)N1CCN(CC1)c1ccc(CCc2ccc(CCOC(=O)NN)s2)nc1 |$;;;;;;;;;;;;;;;;;;;;;;;;HN;;;;$|
Show InChI InChI=1S/C20H27N5O3S/c1-15(26)24-9-11-25(12-10-24)17-4-2-16(22-14-17)3-5-18-6-7-19(29-18)8-13-28-20(27)23-21/h2,4,6-7,14H,3,5,8-13,21H2,1H3,(H,23,27)
US Patent
n/an/a 4n/an/an/an/an/an/a
R-Tech Ueno, Ltd.
US Patent
Assay Description
The compounds of the present invention obtained in Production Examples were examined for the inhibitory effect on human and rat VAP-1 enzyme (SSAO) b...
US Patent US9603833 (2017)
BindingDB Entry DOI: 10.7270/Q2W37ZCW