BDBM310005 2-(5-((Cyclopropylmethyl)(4-(trifluoromethyl)naphthalen-1-yl)amino)-3-methoxypicolinoyl)cyclopropanecarboxylic acid::US9657001, 34
SMILES: CCOC(=O)C1CC1C(=O)c1ncc(cc1OC)N(CC1CC1)c1ccc(c2ccccc12)C(F)(F)F
InChI Key: InChIKey=HWKLRWBWPXPRJY-UHFFFAOYSA-N
Data: 1 IC50
Activity Spreadsheet -- Enzyme Inhibition Constant Data from BindingDB
Found 1 hit for monomerid = 310005
Trg + Lig
Ki
nM
ΔG°
kcal/mole
IC50
nM
Kd
nM
EC50/IC50
nM
koff
s-1
kon
M-1s-1
pHTemp
°C
Leukotriene C4 synthase
(Homo sapiens (Human))
BDBM310005
(2-(5-((Cyclopropylmethyl)(4-(trifluoromethyl)napht...)
Show SMILES CCOC(=O)C1CC1C(=O)c1ncc(cc1OC)N(CC1CC1)c1ccc(c2ccccc12)C(F)(F)F
Show InChI InChI=1S/C28H27F3N2O4/c1-3-37-27(35)21-13-20(21)26(34)25-24(36-2)12-17(14-32-25)33(15-16-8-9-16)23-11-10-22(28(29,30)31)18-6-4-5-7-19(18)23/h4-7,10-12,14,16,20-21H,3,8-9,13,15H2,1-2H3
Reactome pathway
US Patent
n/an/a 19n/an/an/an/an/an/a
ASTRAZENECA AB
US Patent
Assay Description
In the assay, LTC4 synthase catalyses the reaction where the substrate LTA4 methyl ester is converted to LTC4 methyl ester.In order to obtain IC50-va...
US Patent US9657001 (2017)
BindingDB Entry DOI: 10.7270/Q2SJ1NPG