null
SMILES: Cn1c(nc2ccccc12)N(CCCCCCC(=O)C(=O)NO)c1ccc(F)cn1
InChI Key: InChIKey=FUPLZFBIVPRIJI-UHFFFAOYSA-N
Activity Spreadsheet -- Enzyme Inhibition Constant Data from BindingDB
Found 2 hits for monomerid = 310720
Trg + Lig
Ki
nM
ΔG°
kcal/mole
IC50
nM
Kd
nM
EC50/IC50
nM
koff
s-1
kon
M-1s-1
pHTemp
°C
Histone deacetylase 6
(Homo sapiens (Human))
BDBM310720
(8-((5-Fluoropyridin-2-yl)(1-methyl-1H-benzo[d]imid...)
Show SMILES Cn1c(nc2ccccc12)N(CCCCCCC(=O)C(=O)NO)c1ccc(F)cn1
Show InChI InChI=1S/C21H24FN5O3/c1-26-17-9-6-5-8-16(17)24-21(26)27(19-12-11-15(22)14-23-19)13-7-3-2-4-10-18(28)20(29)25-30/h5-6,8-9,11-12,14,30H,2-4,7,10,13H2,1H3,(H,25,29)
NCI pathway
Reactome pathway
US Patent
n/an/a<500n/an/an/an/an/an/a
Karus Therapeutics Limited
US Patent
Assay Description
The assay is described in WO2008/062201.
US Patent US10150763 (2018)
BindingDB Entry DOI: 10.7270/Q2C82CC1
Histone deacetylase 1
(Homo sapiens (Human))
BDBM310720
(8-((5-Fluoropyridin-2-yl)(1-methyl-1H-benzo[d]imid...)
Show SMILES Cn1c(nc2ccccc12)N(CCCCCCC(=O)C(=O)NO)c1ccc(F)cn1
Show InChI InChI=1S/C21H24FN5O3/c1-26-17-9-6-5-8-16(17)24-21(26)27(19-12-11-15(22)14-23-19)13-7-3-2-4-10-18(28)20(29)25-30/h5-6,8-9,11-12,14,30H,2-4,7,10,13H2,1H3,(H,25,29)
NCI pathway
Reactome pathway
US Patent
n/an/a 5.50E+3n/an/an/an/an/an/a
Karus Therapeutics Limited
US Patent
Assay Description
The assay is described in WO2008/062201.
US Patent US10150763 (2018)
BindingDB Entry DOI: 10.7270/Q2C82CC1