BDBM311136 example 5.20 on page 506 of WO15017610
SMILES: C[C@@H](Oc1nc(cn2ncc(C)c12)-c1cnn(c1)C(C)(C)C)[C@H]1CNC(=O)C1
InChI Key: InChIKey=DMHQDPVKKNQNCV-ZIAGYGMSSA-N
Data: 3 IC50
Activity Spreadsheet -- Enzyme Inhibition Constant Data from BindingDB
Found 3 hits for monomerid = 311136
Trg + Lig
Ki
nM
ΔG°
kcal/mole
IC50
nM
Kd
nM
EC50/IC50
nM
koff
s-1
kon
M-1s-1
pHTemp
°C
SYK (aa 342-635)
(Homo sapiens (Human))
BDBM311136
(example 5.20 on page 506 of WO15017610)
Show SMILES C[C@@H](Oc1nc(cn2ncc(C)c12)-c1cnn(c1)C(C)(C)C)[C@H]1CNC(=O)C1 |r|
Show InChI InChI=1S/C20H26N6O2/c1-12-7-22-25-11-16(15-9-23-26(10-15)20(3,4)5)24-19(18(12)25)28-13(2)14-6-17(27)21-8-14/h7,9-11,13-14H,6,8H2,1-5H3,(H,21,27)/t13-,14-/m1/s1
US Patent
n/an/a 0.200n/an/an/an/an/an/a
Boehringer Ingelheim International GmbH
US Patent
Assay Description
Recombinant human SYK (amino acids 342-635) was expressed as a fusion protein with an N-terminal GST tag. The test compounds were dissolved in 100% D...
US Patent US10155751 (2018)
BindingDB Entry DOI: 10.7270/Q2PK0J60
FLT3 (aa 564-960)
(Homo sapiens (Human))
BDBM311136
(example 5.20 on page 506 of WO15017610)
Show SMILES C[C@@H](Oc1nc(cn2ncc(C)c12)-c1cnn(c1)C(C)(C)C)[C@H]1CNC(=O)C1 |r|
Show InChI InChI=1S/C20H26N6O2/c1-12-7-22-25-11-16(15-9-23-26(10-15)20(3,4)5)24-19(18(12)25)28-13(2)14-6-17(27)21-8-14/h7,9-11,13-14H,6,8H2,1-5H3,(H,21,27)/t13-,14-/m1/s1
US Patent
n/an/a 43n/an/an/an/an/an/a
Boehringer Ingelheim International GmbH
US Patent
Assay Description
Recombinant human FLT3 (amino acids 564-958, Molecular weight 48.6 kDa, Invitrogen #PR4666C) was expressed with an Histidine tag. The test compounds...
US Patent US10155751 (2018)
BindingDB Entry DOI: 10.7270/Q2PK0J60
AURB (aa 1-341)
(Homo sapiens (Human))
BDBM311136
(example 5.20 on page 506 of WO15017610)
Show SMILES C[C@@H](Oc1nc(cn2ncc(C)c12)-c1cnn(c1)C(C)(C)C)[C@H]1CNC(=O)C1 |r|
Show InChI InChI=1S/C20H26N6O2/c1-12-7-22-25-11-16(15-9-23-26(10-15)20(3,4)5)24-19(18(12)25)28-13(2)14-6-17(27)21-8-14/h7,9-11,13-14H,6,8H2,1-5H3,(H,21,27)/t13-,14-/m1/s1
US Patent
n/an/a 162n/an/an/an/an/an/a
Boehringer Ingelheim International GmbH
US Patent
Assay Description
Recombinant human Aurora B (amino acids 1-344, clone number DU1773, Molecular weight 40.2 kDa, University of Dundee) was expressed as a fusion protei...
US Patent US10155751 (2018)
BindingDB Entry DOI: 10.7270/Q2PK0J60