null
SMILES: COC(=O)Nc1cc(ccn1)-c1ccc(OC[C@@](C)(N)CC(C)C)c(F)c1
InChI Key: InChIKey=KSQKMAYGHCGBRP-FQEVSTJZSA-N
Activity Spreadsheet -- Enzyme Inhibition Constant Data from BindingDB
Found 10 hits for monomerid = 311184
Trg + Lig
Ki
nM
ΔG°
kcal/mole
IC50
nM
Kd
nM
EC50/IC50
nM
koff
s-1
kon
M-1s-1
pHTemp
°C
AP2-associated protein kinase 1
(Mus musculus)
BDBM311184
((S)-methyl (4-(4-((2-amino-2,4-dimethylpentyl)oxy)...)
Show SMILES COC(=O)Nc1cc(ccn1)-c1ccc(OC[C@@](C)(N)CC(C)C)c(F)c1 |r|
Show InChI InChI=1S/C20H26FN3O3/c1-13(2)11-20(3,22)12-27-17-6-5-14(9-16(17)21)15-7-8-23-18(10-15)24-19(25)26-4/h5-10,13H,11-12,22H2,1-4H3,(H,23,24,25)/t20-/m0/s1
Reactome pathway
0.200n/an/an/an/an/an/an/an/a
TBA
Citation and Details
Article DOI: 10.1021/acs.jmedchem.1c02132
BindingDB Entry DOI: 10.7270/Q2TH8RSP
AP2-associated protein kinase 1
(Homo sapiens (Human))
BDBM311184
((S)-methyl (4-(4-((2-amino-2,4-dimethylpentyl)oxy)...)
Show SMILES COC(=O)Nc1cc(ccn1)-c1ccc(OC[C@@](C)(N)CC(C)C)c(F)c1 |r|
Show InChI InChI=1S/C20H26FN3O3/c1-13(2)11-20(3,22)12-27-17-6-5-14(9-16(17)21)15-7-8-23-18(10-15)24-19(25)26-4/h5-10,13H,11-12,22H2,1-4H3,(H,23,24,25)/t20-/m0/s1
US Patent
n/an/a 1.20n/an/an/an/an/an/a
University of Mississippi
Assay Description
The assays were performed in U-bottom 384-well plates. The final assay volume was 30 μl prepared from 15 μl additions of enzyme and substra...
J Med Chem 48: 2906-15 (2005)
BindingDB Entry DOI: 10.7270/Q2930WGG
AP2-associated protein kinase 1
(Homo sapiens (Human))
BDBM311184
((S)-methyl (4-(4-((2-amino-2,4-dimethylpentyl)oxy)...)
Show SMILES COC(=O)Nc1cc(ccn1)-c1ccc(OC[C@@](C)(N)CC(C)C)c(F)c1 |r|
Show InChI InChI=1S/C20H26FN3O3/c1-13(2)11-20(3,22)12-27-17-6-5-14(9-16(17)21)15-7-8-23-18(10-15)24-19(25)26-4/h5-10,13H,11-12,22H2,1-4H3,(H,23,24,25)/t20-/m0/s1
US Patent
n/an/a 1.20n/an/an/an/an/an/a
Bristol-Myers Squibb Co.
US Patent
Assay Description
The assays were performed in U-bottom 384-well plates. The final assay volume was 30 μl prepared from 15 μl additions of enzyme and substra...
US Patent US10351563 (2019)
BindingDB Entry DOI: 10.7270/Q2P55QWS
AP2-associated protein kinase 1
(Homo sapiens (Human))
BDBM311184
((S)-methyl (4-(4-((2-amino-2,4-dimethylpentyl)oxy)...)
Show SMILES COC(=O)Nc1cc(ccn1)-c1ccc(OC[C@@](C)(N)CC(C)C)c(F)c1 |r|
Show InChI InChI=1S/C20H26FN3O3/c1-13(2)11-20(3,22)12-27-17-6-5-14(9-16(17)21)15-7-8-23-18(10-15)24-19(25)26-4/h5-10,13H,11-12,22H2,1-4H3,(H,23,24,25)/t20-/m0/s1
US Patent
n/an/a 1.20n/an/an/an/an/an/a
Bristol-Myers Squibb Company
US Patent
Assay Description
The assays were performed in U-bottom 384-well plates. The final assay volume was 30 μl prepared from 15 μl additions of enzyme and substra...
US Patent US10544120 (2020)
BindingDB Entry DOI: 10.7270/Q2RF5XCX
Cytochrome P450 3A4
(Homo sapiens (Human))
BDBM311184
((S)-methyl (4-(4-((2-amino-2,4-dimethylpentyl)oxy)...)
Show SMILES COC(=O)Nc1cc(ccn1)-c1ccc(OC[C@@](C)(N)CC(C)C)c(F)c1 |r|
Show InChI InChI=1S/C20H26FN3O3/c1-13(2)11-20(3,22)12-27-17-6-5-14(9-16(17)21)15-7-8-23-18(10-15)24-19(25)26-4/h5-10,13H,11-12,22H2,1-4H3,(H,23,24,25)/t20-/m0/s1
Reactome pathway
n/an/a>2.00E+4n/an/an/an/an/an/a
TBA
Citation and Details
Article DOI: 10.1021/acs.jmedchem.1c02132
BindingDB Entry DOI: 10.7270/Q2TH8RSP
AP2-associated protein kinase 1
(Homo sapiens (Human))
BDBM311184
((S)-methyl (4-(4-((2-amino-2,4-dimethylpentyl)oxy)...)
Show SMILES COC(=O)Nc1cc(ccn1)-c1ccc(OC[C@@](C)(N)CC(C)C)c(F)c1 |r|
Show InChI InChI=1S/C20H26FN3O3/c1-13(2)11-20(3,22)12-27-17-6-5-14(9-16(17)21)15-7-8-23-18(10-15)24-19(25)26-4/h5-10,13H,11-12,22H2,1-4H3,(H,23,24,25)/t20-/m0/s1
US Patent
n/an/a 1.20n/an/an/an/an/an/a
Bristol-Myers Squibb Company
US Patent
Assay Description
The assays were performed in U-bottom 384-well plates. The final assay volume was 30 μl prepared from 15 μl additions of enzyme and substra...
US Patent US10981910 (2021)
BindingDB Entry DOI: 10.7270/Q2CF9T6J
AP2-associated protein kinase 1
(Homo sapiens (Human))
BDBM311184
((S)-methyl (4-(4-((2-amino-2,4-dimethylpentyl)oxy)...)
Show SMILES COC(=O)Nc1cc(ccn1)-c1ccc(OC[C@@](C)(N)CC(C)C)c(F)c1 |r|
Show InChI InChI=1S/C20H26FN3O3/c1-13(2)11-20(3,22)12-27-17-6-5-14(9-16(17)21)15-7-8-23-18(10-15)24-19(25)26-4/h5-10,13H,11-12,22H2,1-4H3,(H,23,24,25)/t20-/m0/s1
n/an/a 1.10n/an/an/an/an/an/a
TBA
Citation and Details
Article DOI: 10.1021/acs.jmedchem.1c02132
BindingDB Entry DOI: 10.7270/Q2TH8RSP
AP2-associated protein kinase 1
(Homo sapiens (Human))
BDBM311184
((S)-methyl (4-(4-((2-amino-2,4-dimethylpentyl)oxy)...)
Show SMILES COC(=O)Nc1cc(ccn1)-c1ccc(OC[C@@](C)(N)CC(C)C)c(F)c1 |r|
Show InChI InChI=1S/C20H26FN3O3/c1-13(2)11-20(3,22)12-27-17-6-5-14(9-16(17)21)15-7-8-23-18(10-15)24-19(25)26-4/h5-10,13H,11-12,22H2,1-4H3,(H,23,24,25)/t20-/m0/s1
n/an/a 1.20n/an/an/an/an/an/a
TBA
Citation and Details
Article DOI: 10.1021/acs.jmedchem.1c02132
BindingDB Entry DOI: 10.7270/Q2TH8RSP
AP2-associated protein kinase 1
(Homo sapiens (Human))
BDBM311184
((S)-methyl (4-(4-((2-amino-2,4-dimethylpentyl)oxy)...)
Show SMILES COC(=O)Nc1cc(ccn1)-c1ccc(OC[C@@](C)(N)CC(C)C)c(F)c1 |r|
Show InChI InChI=1S/C20H26FN3O3/c1-13(2)11-20(3,22)12-27-17-6-5-14(9-16(17)21)15-7-8-23-18(10-15)24-19(25)26-4/h5-10,13H,11-12,22H2,1-4H3,(H,23,24,25)/t20-/m0/s1
US Patent
n/an/a 1.20n/an/an/an/an/an/a
Bristol-Myers Squibb Company
US Patent
Assay Description
The assays were performed in U-bottom 384-well plates. The final assay volume was 30 μl prepared from 15 μl additions of enzyme and substra...
US Patent US10155760 (2018)
BindingDB Entry DOI: 10.7270/Q2F191S4
AP2-associated protein kinase 1
(Homo sapiens (Human))
BDBM311184
((S)-methyl (4-(4-((2-amino-2,4-dimethylpentyl)oxy)...)
Show SMILES COC(=O)Nc1cc(ccn1)-c1ccc(OC[C@@](C)(N)CC(C)C)c(F)c1 |r|
Show InChI InChI=1S/C20H26FN3O3/c1-13(2)11-20(3,22)12-27-17-6-5-14(9-16(17)21)15-7-8-23-18(10-15)24-19(25)26-4/h5-10,13H,11-12,22H2,1-4H3,(H,23,24,25)/t20-/m0/s1
US Patent
n/an/a 1.20n/an/an/an/an/an/a
Bristol-Myers Squibb Company
US Patent
Assay Description
The assays were performed in U-bottom 384-well plates. The final assay volume was 30 Cl prepared from 15 μl additions of enzyme and substrates (...
US Patent US10723734 (2020)
BindingDB Entry DOI: 10.7270/Q2Z60S4P