null
SMILES: CC(C)C[C@](C)(N)COc1cnc(cc1C(F)F)-c1ccnc(c1)C(F)F
InChI Key: InChIKey=HVHRHDHQHUAOQI-IBGZPJMESA-N
Activity Spreadsheet -- Enzyme Inhibition Constant Data from BindingDB
Found 6 hits for monomerid = 311268
Trg + Lig
Ki
nM
ΔG°
kcal/mole
IC50
nM
Kd
nM
EC50/IC50
nM
koff
s-1
kon
M-1s-1
pHTemp
°C
AP2-associated protein kinase 1
(Homo sapiens (Human))
BDBM311268
((S)-1-((2′,4-bis(difluoromethyl)-[2,4′...)
Show SMILES CC(C)C[C@](C)(N)COc1cnc(cc1C(F)F)-c1ccnc(c1)C(F)F |r|
Show InChI InChI=1S/C19H23F4N3O/c1-11(2)8-19(3,24)10-27-16-9-26-14(7-13(16)17(20)21)12-4-5-25-15(6-12)18(22)23/h4-7,9,11,17-18H,8,10,24H2,1-3H3/t19-/m0/s1
US Patent
n/an/a 1.20n/an/an/an/an/an/a
Bristol-Myers Squibb Company
US Patent
Assay Description
The assays were performed in U-bottom 384-well plates. The final assay volume was 30 μl prepared from 15 μl additions of enzyme and substra...
US Patent US10155760 (2018)
BindingDB Entry DOI: 10.7270/Q2F191S4
AP2-associated protein kinase 1
(Homo sapiens (Human))
BDBM311268
((S)-1-((2′,4-bis(difluoromethyl)-[2,4′...)
Show SMILES CC(C)C[C@](C)(N)COc1cnc(cc1C(F)F)-c1ccnc(c1)C(F)F |r|
Show InChI InChI=1S/C19H23F4N3O/c1-11(2)8-19(3,24)10-27-16-9-26-14(7-13(16)17(20)21)12-4-5-25-15(6-12)18(22)23/h4-7,9,11,17-18H,8,10,24H2,1-3H3/t19-/m0/s1
US Patent
n/an/a 1.20n/an/an/an/an/an/a
University of Mississippi
Assay Description
The assays were performed in U-bottom 384-well plates. The final assay volume was 30 μl prepared from 15 μl additions of enzyme and substra...
J Med Chem 48: 2906-15 (2005)
BindingDB Entry DOI: 10.7270/Q2930WGG
AP2-associated protein kinase 1
(Homo sapiens (Human))
BDBM311268
((S)-1-((2′,4-bis(difluoromethyl)-[2,4′...)
Show SMILES CC(C)C[C@](C)(N)COc1cnc(cc1C(F)F)-c1ccnc(c1)C(F)F |r|
Show InChI InChI=1S/C19H23F4N3O/c1-11(2)8-19(3,24)10-27-16-9-26-14(7-13(16)17(20)21)12-4-5-25-15(6-12)18(22)23/h4-7,9,11,17-18H,8,10,24H2,1-3H3/t19-/m0/s1
US Patent
n/an/a 1.20n/an/an/an/an/an/a
Bristol-Myers Squibb Company
US Patent
Assay Description
The assays were performed in U-bottom 384-well plates. The final assay volume was 30 μl prepared from 15 μl additions of enzyme and substra...
US Patent US10981910 (2021)
AP2-associated protein kinase 1
(Homo sapiens (Human))
BDBM311268
((S)-1-((2′,4-bis(difluoromethyl)-[2,4′...)
Show SMILES CC(C)C[C@](C)(N)COc1cnc(cc1C(F)F)-c1ccnc(c1)C(F)F |r|
Show InChI InChI=1S/C19H23F4N3O/c1-11(2)8-19(3,24)10-27-16-9-26-14(7-13(16)17(20)21)12-4-5-25-15(6-12)18(22)23/h4-7,9,11,17-18H,8,10,24H2,1-3H3/t19-/m0/s1
US Patent
n/an/a 1.20n/an/an/an/an/an/a
Bristol-Myers Squibb Company
US Patent
Assay Description
The assays were performed in U-bottom 384-well plates. The final assay volume was 30 μl prepared from 15 μl additions of enzyme and substra...
US Patent US10544120 (2020)
BindingDB Entry DOI: 10.7270/Q2RF5XCX
AP2-associated protein kinase 1
(Homo sapiens (Human))
BDBM311268
((S)-1-((2′,4-bis(difluoromethyl)-[2,4′...)
Show SMILES CC(C)C[C@](C)(N)COc1cnc(cc1C(F)F)-c1ccnc(c1)C(F)F |r|
Show InChI InChI=1S/C19H23F4N3O/c1-11(2)8-19(3,24)10-27-16-9-26-14(7-13(16)17(20)21)12-4-5-25-15(6-12)18(22)23/h4-7,9,11,17-18H,8,10,24H2,1-3H3/t19-/m0/s1
US Patent
n/an/a 1.20n/an/an/an/an/an/a
Bristol-Myers Squibb Company
US Patent
Assay Description
The assays were performed in U-bottom 384-well plates. The final assay volume was 30 Cl prepared from 15 μl additions of enzyme and substrates (...
US Patent US10723734 (2020)
AP2-associated protein kinase 1
(Homo sapiens (Human))
BDBM311268
((S)-1-((2′,4-bis(difluoromethyl)-[2,4′...)
Show SMILES CC(C)C[C@](C)(N)COc1cnc(cc1C(F)F)-c1ccnc(c1)C(F)F |r|
Show InChI InChI=1S/C19H23F4N3O/c1-11(2)8-19(3,24)10-27-16-9-26-14(7-13(16)17(20)21)12-4-5-25-15(6-12)18(22)23/h4-7,9,11,17-18H,8,10,24H2,1-3H3/t19-/m0/s1
US Patent
n/an/a 1.20n/an/an/an/an/an/a
Bristol-Myers Squibb Co.
US Patent
Assay Description
The assays were performed in U-bottom 384-well plates. The final assay volume was 30 μl prepared from 15 μl additions of enzyme and substra...
US Patent US10351563 (2019)
BindingDB Entry DOI: 10.7270/Q2P55QWS