BDBM311291 (S)-1-((2′-chloro-4-(difluoromethyl)-[2,4′-bipyridin]-5-yl)oxy)-2,4-dimethylpentan-2-amine::US10155760, Example 147::US10351563, Example 147::US10544120, Example 147::US10723734, Example 147::US10981910, Example 147::US9902722, Example 147
SMILES: CC(C)C[C@](C)(N)COc1cnc(cc1C(F)F)-c1ccnc(Cl)c1
InChI Key: InChIKey=QHPJIUARPKBLQQ-SFHVURJKSA-N
Data: 6 IC50
Activity Spreadsheet -- Enzyme Inhibition Constant Data from BindingDB
Found 6 hits for monomerid = 311291
Trg + Lig
Ki
nM
ΔG°
kcal/mole
IC50
nM
Kd
nM
EC50/IC50
nM
koff
s-1
kon
M-1s-1
pHTemp
°C
AP2-associated protein kinase 1
(Homo sapiens (Human))
BDBM311291
((S)-1-((2′-chloro-4-(difluoromethyl)-[2,4...)
Show SMILES CC(C)C[C@](C)(N)COc1cnc(cc1C(F)F)-c1ccnc(Cl)c1 |r|
Show InChI InChI=1S/C18H22ClF2N3O/c1-11(2)8-18(3,22)10-25-15-9-24-14(7-13(15)17(20)21)12-4-5-23-16(19)6-12/h4-7,9,11,17H,8,10,22H2,1-3H3/t18-/m0/s1
US Patent
n/an/a 0.560n/an/an/an/an/an/a
Bristol-Myers Squibb Company
US Patent
Assay Description
The assays were performed in U-bottom 384-well plates. The final assay volume was 30 μl prepared from 15 μl additions of enzyme and substra...
US Patent US10155760 (2018)
BindingDB Entry DOI: 10.7270/Q2F191S4
AP2-associated protein kinase 1
(Homo sapiens (Human))
BDBM311291
((S)-1-((2′-chloro-4-(difluoromethyl)-[2,4...)
Show SMILES CC(C)C[C@](C)(N)COc1cnc(cc1C(F)F)-c1ccnc(Cl)c1 |r|
Show InChI InChI=1S/C18H22ClF2N3O/c1-11(2)8-18(3,22)10-25-15-9-24-14(7-13(15)17(20)21)12-4-5-23-16(19)6-12/h4-7,9,11,17H,8,10,22H2,1-3H3/t18-/m0/s1
US Patent
n/an/a 0.560n/an/an/an/an/an/a
University of Mississippi
Assay Description
The assays were performed in U-bottom 384-well plates. The final assay volume was 30 μl prepared from 15 μl additions of enzyme and substra...
J Med Chem 48: 2906-15 (2005)
BindingDB Entry DOI: 10.7270/Q2930WGG
AP2-associated protein kinase 1
(Homo sapiens (Human))
BDBM311291
((S)-1-((2′-chloro-4-(difluoromethyl)-[2,4...)
Show SMILES CC(C)C[C@](C)(N)COc1cnc(cc1C(F)F)-c1ccnc(Cl)c1 |r|
Show InChI InChI=1S/C18H22ClF2N3O/c1-11(2)8-18(3,22)10-25-15-9-24-14(7-13(15)17(20)21)12-4-5-23-16(19)6-12/h4-7,9,11,17H,8,10,22H2,1-3H3/t18-/m0/s1
US Patent
n/an/a 0.560n/an/an/an/an/an/a
Bristol-Myers Squibb Company
US Patent
Assay Description
The assays were performed in U-bottom 384-well plates. The final assay volume was 30 μl prepared from 15 μl additions of enzyme and substra...
US Patent US10981910 (2021)
AP2-associated protein kinase 1
(Homo sapiens (Human))
BDBM311291
((S)-1-((2′-chloro-4-(difluoromethyl)-[2,4...)
Show SMILES CC(C)C[C@](C)(N)COc1cnc(cc1C(F)F)-c1ccnc(Cl)c1 |r|
Show InChI InChI=1S/C18H22ClF2N3O/c1-11(2)8-18(3,22)10-25-15-9-24-14(7-13(15)17(20)21)12-4-5-23-16(19)6-12/h4-7,9,11,17H,8,10,22H2,1-3H3/t18-/m0/s1
US Patent
n/an/a 0.560n/an/an/an/an/an/a
Bristol-Myers Squibb Company
US Patent
Assay Description
The assays were performed in U-bottom 384-well plates. The final assay volume was 30 μl prepared from 15 μl additions of enzyme and substra...
US Patent US10544120 (2020)
BindingDB Entry DOI: 10.7270/Q2RF5XCX
AP2-associated protein kinase 1
(Homo sapiens (Human))
BDBM311291
((S)-1-((2′-chloro-4-(difluoromethyl)-[2,4...)
Show SMILES CC(C)C[C@](C)(N)COc1cnc(cc1C(F)F)-c1ccnc(Cl)c1 |r|
Show InChI InChI=1S/C18H22ClF2N3O/c1-11(2)8-18(3,22)10-25-15-9-24-14(7-13(15)17(20)21)12-4-5-23-16(19)6-12/h4-7,9,11,17H,8,10,22H2,1-3H3/t18-/m0/s1
US Patent
n/an/a 0.560n/an/an/an/an/an/a
Bristol-Myers Squibb Company
US Patent
Assay Description
The assays were performed in U-bottom 384-well plates. The final assay volume was 30 Cl prepared from 15 μl additions of enzyme and substrates (...
US Patent US10723734 (2020)
AP2-associated protein kinase 1
(Homo sapiens (Human))
BDBM311291
((S)-1-((2′-chloro-4-(difluoromethyl)-[2,4...)
Show SMILES CC(C)C[C@](C)(N)COc1cnc(cc1C(F)F)-c1ccnc(Cl)c1 |r|
Show InChI InChI=1S/C18H22ClF2N3O/c1-11(2)8-18(3,22)10-25-15-9-24-14(7-13(15)17(20)21)12-4-5-23-16(19)6-12/h4-7,9,11,17H,8,10,22H2,1-3H3/t18-/m0/s1
US Patent
n/an/a 0.560n/an/an/an/an/an/a
Bristol-Myers Squibb Co.
US Patent
Assay Description
The assays were performed in U-bottom 384-well plates. The final assay volume was 30 μl prepared from 15 μl additions of enzyme and substra...
US Patent US10351563 (2019)
BindingDB Entry DOI: 10.7270/Q2P55QWS