BDBM311338 (S)-1-((3-(difluoromethyl)-5-(7-fluoroquinolin-4-yl)pyridin-2-yl)oxy)-2,4-dimethylpentan-2-amine::US10155760, Example 195::US10351563, Example 195::US10544120, Example 195::US10723734, Example 195::US10981910, Example 195::US9902722, Example 195
SMILES: CC(C)C[C@](C)(N)COc1ncc(cc1C(F)F)-c1ccnc2cc(F)ccc12
InChI Key: InChIKey=FEGPESNEZYWGEQ-QFIPXVFZSA-N
Data: 6 IC50
Activity Spreadsheet -- Enzyme Inhibition Constant Data from BindingDB
Found 6 hits for monomerid = 311338
Trg + Lig
Ki
nM
ΔG°
kcal/mole
IC50
nM
Kd
nM
EC50/IC50
nM
koff
s-1
kon
M-1s-1
pHTemp
°C
AP2-associated protein kinase 1
(Homo sapiens (Human))
BDBM311338
((S)-1-((3-(difluoromethyl)-5-(7-fluoroquinolin-4-y...)
Show SMILES CC(C)C[C@](C)(N)COc1ncc(cc1C(F)F)-c1ccnc2cc(F)ccc12 |r|
Show InChI InChI=1S/C22H24F3N3O/c1-13(2)10-22(3,26)12-29-21-18(20(24)25)8-14(11-28-21)16-6-7-27-19-9-15(23)4-5-17(16)19/h4-9,11,13,20H,10,12,26H2,1-3H3/t22-/m0/s1
US Patent
n/an/a 0.25n/an/an/an/an/an/a
Bristol-Myers Squibb Company
US Patent
Assay Description
The assays were performed in U-bottom 384-well plates. The final assay volume was 30 μl prepared from 15 μl additions of enzyme and substra...
US Patent US10155760 (2018)
BindingDB Entry DOI: 10.7270/Q2F191S4
AP2-associated protein kinase 1
(Homo sapiens (Human))
BDBM311338
((S)-1-((3-(difluoromethyl)-5-(7-fluoroquinolin-4-y...)
Show SMILES CC(C)C[C@](C)(N)COc1ncc(cc1C(F)F)-c1ccnc2cc(F)ccc12 |r|
Show InChI InChI=1S/C22H24F3N3O/c1-13(2)10-22(3,26)12-29-21-18(20(24)25)8-14(11-28-21)16-6-7-27-19-9-15(23)4-5-17(16)19/h4-9,11,13,20H,10,12,26H2,1-3H3/t22-/m0/s1
US Patent
n/an/a 0.25n/an/an/an/an/an/a
University of Mississippi
Assay Description
The assays were performed in U-bottom 384-well plates. The final assay volume was 30 μl prepared from 15 μl additions of enzyme and substra...
J Med Chem 48: 2906-15 (2005)
BindingDB Entry DOI: 10.7270/Q2930WGG
AP2-associated protein kinase 1
(Homo sapiens (Human))
BDBM311338
((S)-1-((3-(difluoromethyl)-5-(7-fluoroquinolin-4-y...)
Show SMILES CC(C)C[C@](C)(N)COc1ncc(cc1C(F)F)-c1ccnc2cc(F)ccc12 |r|
Show InChI InChI=1S/C22H24F3N3O/c1-13(2)10-22(3,26)12-29-21-18(20(24)25)8-14(11-28-21)16-6-7-27-19-9-15(23)4-5-17(16)19/h4-9,11,13,20H,10,12,26H2,1-3H3/t22-/m0/s1
US Patent
n/an/a 0.25n/an/an/an/an/an/a
Bristol-Myers Squibb Company
US Patent
Assay Description
The assays were performed in U-bottom 384-well plates. The final assay volume was 30 μl prepared from 15 μl additions of enzyme and substra...
US Patent US10981910 (2021)
AP2-associated protein kinase 1
(Homo sapiens (Human))
BDBM311338
((S)-1-((3-(difluoromethyl)-5-(7-fluoroquinolin-4-y...)
Show SMILES CC(C)C[C@](C)(N)COc1ncc(cc1C(F)F)-c1ccnc2cc(F)ccc12 |r|
Show InChI InChI=1S/C22H24F3N3O/c1-13(2)10-22(3,26)12-29-21-18(20(24)25)8-14(11-28-21)16-6-7-27-19-9-15(23)4-5-17(16)19/h4-9,11,13,20H,10,12,26H2,1-3H3/t22-/m0/s1
US Patent
n/an/a 0.25n/an/an/an/an/an/a
Bristol-Myers Squibb Company
US Patent
Assay Description
The assays were performed in U-bottom 384-well plates. The final assay volume was 30 μl prepared from 15 μl additions of enzyme and substra...
US Patent US10544120 (2020)
BindingDB Entry DOI: 10.7270/Q2RF5XCX
AP2-associated protein kinase 1
(Homo sapiens (Human))
BDBM311338
((S)-1-((3-(difluoromethyl)-5-(7-fluoroquinolin-4-y...)
Show SMILES CC(C)C[C@](C)(N)COc1ncc(cc1C(F)F)-c1ccnc2cc(F)ccc12 |r|
Show InChI InChI=1S/C22H24F3N3O/c1-13(2)10-22(3,26)12-29-21-18(20(24)25)8-14(11-28-21)16-6-7-27-19-9-15(23)4-5-17(16)19/h4-9,11,13,20H,10,12,26H2,1-3H3/t22-/m0/s1
US Patent
n/an/a 0.25n/an/an/an/an/an/a
Bristol-Myers Squibb Company
US Patent
Assay Description
The assays were performed in U-bottom 384-well plates. The final assay volume was 30 Cl prepared from 15 μl additions of enzyme and substrates (...
US Patent US10723734 (2020)
AP2-associated protein kinase 1
(Homo sapiens (Human))
BDBM311338
((S)-1-((3-(difluoromethyl)-5-(7-fluoroquinolin-4-y...)
Show SMILES CC(C)C[C@](C)(N)COc1ncc(cc1C(F)F)-c1ccnc2cc(F)ccc12 |r|
Show InChI InChI=1S/C22H24F3N3O/c1-13(2)10-22(3,26)12-29-21-18(20(24)25)8-14(11-28-21)16-6-7-27-19-9-15(23)4-5-17(16)19/h4-9,11,13,20H,10,12,26H2,1-3H3/t22-/m0/s1
US Patent
n/an/a 0.25n/an/an/an/an/an/a
Bristol-Myers Squibb Co.
US Patent
Assay Description
The assays were performed in U-bottom 384-well plates. The final assay volume was 30 μl prepared from 15 μl additions of enzyme and substra...
US Patent US10351563 (2019)
BindingDB Entry DOI: 10.7270/Q2P55QWS