null
SMILES: CN(C)[C@H]1CCCC[C@H]1Nc1nn(C)c(=O)c2cccnc12
InChI Key: InChIKey=VKNNVNWETCTNHL-OLZOCXBDSA-N
Activity Spreadsheet -- Enzyme Inhibition Constant Data from BindingDB
Found 1 hit for monomerid = 311422
Trg + Lig
Ki
nM
ΔG°
kcal/mole
IC50
nM
Kd
nM
EC50/IC50
nM
koff
s-1
kon
M-1s-1
pHTemp
°C
Histone acetyltransferase KAT2B [719-832]
(Homo sapiens (Human))
BDBM311422
(US10155764, Example 15A)
Show SMILES CN(C)[C@H]1CCCC[C@H]1Nc1nn(C)c(=O)c2cccnc12 |r|
Show InChI InChI=1S/C16H23N5O/c1-20(2)13-9-5-4-8-12(13)18-15-14-11(7-6-10-17-14)16(22)21(3)19-15/h6-7,10,12-13H,4-5,8-9H2,1-3H3,(H,18,19)/t12-,13+/m1/s1
NCI pathway
Reactome pathway
US Patent
n/an/a 78n/an/an/an/an/an/a
GENENTECH, INC; CONSTELLATION PHARMACEUTICALS, INC.
US Patent
Assay Description
His/Flag epitope tagged PCAF719-832 bromodomain was cloned, expressed and purified to homogeneity in-house. PCAF bromodomain binding and inhibition o...
US Patent US10155764 (2018)
BindingDB Entry DOI: 10.7270/Q25M67T9