null
SMILES: COCc1ccc(NC(=O)c2c(C#CC(C)O)n(c3ncnc(N)c23)C2(C)CC2)cc1
InChI Key: InChIKey=ODCGRCORNYBTKK-UHFFFAOYSA-N
Activity Spreadsheet -- Enzyme Inhibition Constant Data from BindingDB
Found 7 hits for monomerid = 311672
Trg + Lig
Ki
nM
ΔG°
kcal/mole
IC50
nM
Kd
nM
EC50/IC50
nM
koff
s-1
kon
M-1s-1
pHTemp
°C
Proto-oncogene tyrosine-protein kinase receptor Ret
(Homo sapiens (Human))
BDBM311672
(Ex. Cpd. 124 | Ex. Cpd. 204 | US10807986, Example ...)
Show SMILES COCc1ccc(NC(=O)c2c(C#CC(C)O)n(c3ncnc(N)c23)C2(C)CC2)cc1
Show InChI InChI=1S/C23H25N5O3/c1-14(29)4-9-17-18(22(30)27-16-7-5-15(6-8-16)12-31-3)19-20(24)25-13-26-21(19)28(17)23(2)10-11-23/h5-8,13-14,29H,10-12H2,1-3H3,(H,27,30)(H2,24,25,26)
US Patent
n/an/a 0.400n/an/an/an/an/an/a
Taiho Pharmaceutical Co., Ltd.
US Patent
Assay Description
Regarding the conditions for measurement of in vitro inhibitory activity of compounds against RET kinase activity, the website of AnaSpec states that...
US Patent US10155768 (2018)
BindingDB Entry DOI: 10.7270/Q2X350J3
Proto-oncogene tyrosine-protein kinase receptor Ret
(Homo sapiens (Human))
BDBM311672
(Ex. Cpd. 124 | Ex. Cpd. 204 | US10807986, Example ...)
Show SMILES COCc1ccc(NC(=O)c2c(C#CC(C)O)n(c3ncnc(N)c23)C2(C)CC2)cc1
Show InChI InChI=1S/C23H25N5O3/c1-14(29)4-9-17-18(22(30)27-16-7-5-15(6-8-16)12-31-3)19-20(24)25-13-26-21(19)28(17)23(2)10-11-23/h5-8,13-14,29H,10-12H2,1-3H3,(H,27,30)(H2,24,25,26)
US Patent
n/an/a 8.60n/an/an/an/an/an/a
Taiho Pharmaceutical Co., Ltd.
US Patent
Assay Description
Regarding the conditions for measurement of in vitro inhibitory activity of compounds against RET kinase activity, the website of AnaSpec states that...
US Patent US10155768 (2018)
BindingDB Entry DOI: 10.7270/Q2X350J3
Proto-oncogene tyrosine-protein kinase receptor Ret [V804L]
(Homo sapiens (Human))
BDBM311672
(Ex. Cpd. 124 | Ex. Cpd. 204 | US10807986, Example ...)
Show SMILES COCc1ccc(NC(=O)c2c(C#CC(C)O)n(c3ncnc(N)c23)C2(C)CC2)cc1
Show InChI InChI=1S/C23H25N5O3/c1-14(29)4-9-17-18(22(30)27-16-7-5-15(6-8-16)12-31-3)19-20(24)25-13-26-21(19)28(17)23(2)10-11-23/h5-8,13-14,29H,10-12H2,1-3H3,(H,27,30)(H2,24,25,26)
US Patent
n/an/a 1.40n/an/an/an/an/an/a
Taiho Pharmaceutical Co., Ltd.
US Patent
Assay Description
Regarding the conditions for measurement of in vitro inhibitory activity of compounds against RET (V804L) (i.e., RET with V804L mutation) kinase acti...
US Patent US10155768 (2018)
BindingDB Entry DOI: 10.7270/Q2X350J3
Proto-oncogene tyrosine-protein kinase receptor Ret [V804M]
(Homo sapiens (Human))
BDBM311672
(Ex. Cpd. 124 | Ex. Cpd. 204 | US10807986, Example ...)
Show SMILES COCc1ccc(NC(=O)c2c(C#CC(C)O)n(c3ncnc(N)c23)C2(C)CC2)cc1
Show InChI InChI=1S/C23H25N5O3/c1-14(29)4-9-17-18(22(30)27-16-7-5-15(6-8-16)12-31-3)19-20(24)25-13-26-21(19)28(17)23(2)10-11-23/h5-8,13-14,29H,10-12H2,1-3H3,(H,27,30)(H2,24,25,26)
US Patent
n/an/a 3.70n/an/an/an/an/an/a
Taiho Pharmaceutical Co., Ltd.
US Patent
Assay Description
Regarding the conditions for measurement of in vitro inhibitory activity of compounds against RET (V804L or V804M) (i.e., RET with V804L or V804M mut...
US Patent US10807986 (2020)
Proto-oncogene tyrosine-protein kinase receptor Ret
(Homo sapiens (Human))
BDBM311672
(Ex. Cpd. 124 | Ex. Cpd. 204 | US10807986, Example ...)
Show SMILES COCc1ccc(NC(=O)c2c(C#CC(C)O)n(c3ncnc(N)c23)C2(C)CC2)cc1
Show InChI InChI=1S/C23H25N5O3/c1-14(29)4-9-17-18(22(30)27-16-7-5-15(6-8-16)12-31-3)19-20(24)25-13-26-21(19)28(17)23(2)10-11-23/h5-8,13-14,29H,10-12H2,1-3H3,(H,27,30)(H2,24,25,26)
US Patent
n/an/a 0.400n/an/an/an/an/an/a
Taiho Pharmaceutical Co., Ltd.
US Patent
Assay Description
Regarding the conditions for measurement of in vitro inhibitory activity of compounds against RET kinase activity, the website of AnaSpec states that...
US Patent US10807986 (2020)
Proto-oncogene tyrosine-protein kinase receptor Ret [V804L]
(Homo sapiens (Human))
BDBM311672
(Ex. Cpd. 124 | Ex. Cpd. 204 | US10807986, Example ...)
Show SMILES COCc1ccc(NC(=O)c2c(C#CC(C)O)n(c3ncnc(N)c23)C2(C)CC2)cc1
Show InChI InChI=1S/C23H25N5O3/c1-14(29)4-9-17-18(22(30)27-16-7-5-15(6-8-16)12-31-3)19-20(24)25-13-26-21(19)28(17)23(2)10-11-23/h5-8,13-14,29H,10-12H2,1-3H3,(H,27,30)(H2,24,25,26)
US Patent
n/an/a 1.40n/an/an/an/an/an/a
Taiho Pharmaceutical Co., Ltd.
US Patent
Assay Description
Regarding the conditions for measurement of in vitro inhibitory activity of compounds against RET (V804L or V804M) (i.e., RET with V804L or V804M mut...
US Patent US10807986 (2020)
Proto-oncogene tyrosine-protein kinase receptor Ret [V804M]
(Homo sapiens (Human))
BDBM311672
(Ex. Cpd. 124 | Ex. Cpd. 204 | US10807986, Example ...)
Show SMILES COCc1ccc(NC(=O)c2c(C#CC(C)O)n(c3ncnc(N)c23)C2(C)CC2)cc1
Show InChI InChI=1S/C23H25N5O3/c1-14(29)4-9-17-18(22(30)27-16-7-5-15(6-8-16)12-31-3)19-20(24)25-13-26-21(19)28(17)23(2)10-11-23/h5-8,13-14,29H,10-12H2,1-3H3,(H,27,30)(H2,24,25,26)
US Patent
n/an/a 3.70n/an/an/an/an/an/a
Taiho Pharmaceutical Co., Ltd.
US Patent
Assay Description
RET (V804M) (i.e., RET with V804M mutation) kinase activity was measured using purified recombinant human RET (V804M) protein purchased from Eurofins...
US Patent US10155768 (2018)
BindingDB Entry DOI: 10.7270/Q2X350J3