BDBM311847 5-(2,7-Bis(trifluoromethyl)imidazo[1,2-a]pyridin-8-yl)-7-chloro-1H-indazole::US10155769, Example 88
SMILES: FC(F)(F)c1cn2ccc(c(-c3cc(Cl)c4[nH]ncc4c3)c2n1)C(F)(F)F
InChI Key: InChIKey=SSJJQPAUORKMHJ-UHFFFAOYSA-N
Data: 1 IC50
Activity Spreadsheet -- Enzyme Inhibition Constant Data from BindingDB
Found 1 hit for monomerid = 311847
Trg + Lig
Ki
nM
ΔG°
kcal/mole
IC50
nM
Kd
nM
EC50/IC50
nM
koff
s-1
kon
M-1s-1
pHTemp
°C
Voltage-dependent calcium channel gamma-2 subunit
(Homo sapiens (Human))
BDBM311847
(5-(2,7-Bis(trifluoromethyl)imidazo[1,2-a]pyridin-8...)
Show SMILES FC(F)(F)c1cn2ccc(c(-c3cc(Cl)c4[nH]ncc4c3)c2n1)C(F)(F)F
Show InChI InChI=1S/C16H7ClF6N4/c17-10-4-7(3-8-5-24-26-13(8)10)12-9(15(18,19)20)1-2-27-6-11(16(21,22)23)25-14(12)27/h1-6H,(H,24,26)
US Patent
n/an/a 0.0500n/an/an/an/an/an/a
Janssen Pharmaceutica NV
US Patent
Assay Description
An in vitro assay was used to determine the potency of test compounds as inhibitors of the glutamate response of the channel formed by GluA1o-γ8...
US Patent US10155769 (2018)
BindingDB Entry DOI: 10.7270/Q2SB47TC