BDBM31206 NSC 66811
SMILES: Cc1ccc2ccc(C(Nc3ccccc3)c3ccccc3)c(O)c2n1
InChI Key: InChIKey=WEENRMPCSWFMTE-UHFFFAOYSA-N
Data: 1 KI
Activity Spreadsheet -- Enzyme Inhibition Constant Data from BindingDB
Found 1 hit for monomerid = 31206
Trg + Lig
Ki
nM
ΔG°
kcal/mole
IC50
nM
Kd
nM
EC50/IC50
nM
koff
s-1
kon
M-1s-1
pHTemp
°C
MDM2-MDMX
(Homo sapiens (Human))
BDBM31206
(NSC 66811)
Show SMILES Cc1ccc2ccc(C(Nc3ccccc3)c3ccccc3)c(O)c2n1
Show InChI InChI=1S/C23H20N2O/c1-16-12-13-18-14-15-20(23(26)22(18)24-16)21(17-8-4-2-5-9-17)25-19-10-6-3-7-11-19/h2-15,21,25-26H,1H3
NCI pathway
Reactome pathway
120 -9.37n/an/an/an/an/a7.523
University of Michigan
Assay Description
The dose-dependent binding experiments were carried out with serial dilutions of the tested compounds in DMSO. A 5 ul sample of the tested samples an...
J Med Chem 49: 3759-62 (2006)
Article DOI: 10.1021/jm060023+
BindingDB Entry DOI: 10.7270/Q20P0XCM