BDBM31213 2-phenoxybenzoyltryptophan derivative, R2C3
SMILES: OC(=O)[C@H](Cc1cn(C(=O)OCc2ccccc2)c2cc(Cl)ccc12)NC(=O)c1ccccc1Oc1ccccc1
InChI Key: InChIKey=USVVJMSKOUQARY-MHZLTWQESA-N
Data: 1 KI
Activity Spreadsheet -- Enzyme Inhibition Constant Data from BindingDB
Found 1 hit for monomerid = 31213
Trg + Lig
Ki
nM
ΔG°
kcal/mole
IC50
nM
Kd
nM
EC50/IC50
nM
koff
s-1
kon
M-1s-1
pHTemp
°C
MDM2-MDMX
(Homo sapiens (Human))
BDBM31213
(2-phenoxybenzoyltryptophan derivative, R2C3)
Show SMILES OC(=O)[C@H](Cc1cn(C(=O)OCc2ccccc2)c2cc(Cl)ccc12)NC(=O)c1ccccc1Oc1ccccc1 |r|
Show InChI InChI=1S/C32H25ClN2O6/c33-23-15-16-25-22(19-35(28(25)18-23)32(39)40-20-21-9-3-1-4-10-21)17-27(31(37)38)34-30(36)26-13-7-8-14-29(26)41-24-11-5-2-6-12-24/h1-16,18-19,27H,17,20H2,(H,34,36)(H,37,38)/t27-/m0/s1
NCI pathway
Reactome pathway
600 -8.43n/an/an/an/an/a7.423
Schering-Plough Research Institute
Assay Description
Ki values were determined from a competition experiment in which serial dilutions of inhibitor were added to compete against a fixed concentration (1...
Anal Biochem 331: 138-46 (2004)
Article DOI: 10.1016/j.ab.2004.03.009
BindingDB Entry DOI: 10.7270/Q2VX0DVV