null
SMILES: NC1=N[C@]2(COCC[C@H]2CS1)c1cc(NC(=O)c2ccc(cn2)C#N)cs1
InChI Key: InChIKey=LAOKNTCIMWLGDD-SGTLLEGYSA-N
Activity Spreadsheet -- Enzyme Inhibition Constant Data from BindingDB
Found 2 hits for monomerid = 312939
Trg + Lig
Ki
nM
ΔG°
kcal/mole
IC50
nM
Kd
nM
EC50/IC50
nM
koff
s-1
kon
M-1s-1
pHTemp
°C
Potassium voltage-gated channel subfamily H member 2
(Homo sapiens (Human))
BDBM312939
(Ex. 64 of US 8198269 | US9605007, Comparator 5)
Show SMILES NC1=N[C@]2(COCC[C@H]2CS1)c1cc(NC(=O)c2ccc(cn2)C#N)cs1 |r,t:1|
Show InChI InChI=1S/C18H17N5O2S2/c19-6-11-1-2-14(21-7-11)16(24)22-13-5-15(26-9-13)18-10-25-4-3-12(18)8-27-17(20)23-18/h1-2,5,7,9,12H,3-4,8,10H2,(H2,20,23)(H,22,24)/t12-,18-/m0/s1
Reactome pathway
US Patent
n/an/a 1.80E+3n/an/an/an/an/an/a
Pfizer Inc.
US Patent
Assay Description
All testing was carried out in CHO cells transfected with the hERG gene purchased from Millipore (PrecisION hERG-CHO Recombinant Cell Line CYL3038). ...
US Patent US9605007 (2017)
BindingDB Entry DOI: 10.7270/Q2JQ133S
Beta-secretase 1
(Homo sapiens (Human))
BDBM312939
(Ex. 64 of US 8198269 | US9605007, Comparator 5)
Show SMILES NC1=N[C@]2(COCC[C@H]2CS1)c1cc(NC(=O)c2ccc(cn2)C#N)cs1 |r,t:1|
Show InChI InChI=1S/C18H17N5O2S2/c19-6-11-1-2-14(21-7-11)16(24)22-13-5-15(26-9-13)18-10-25-4-3-12(18)8-27-17(20)23-18/h1-2,5,7,9,12H,3-4,8,10H2,(H2,20,23)(H,22,24)/t12-,18-/m0/s1
US Patent
n/an/a 19n/an/an/an/an/an/a
Pfizer Inc.
US Patent
Assay Description
The BACE1 and BACE2 binding assays measured beta-site amyloid precursor protein-cleaving enzyme (BACE) binding as a decrease in the counts of radioli...
US Patent US9605007 (2017)
BindingDB Entry DOI: 10.7270/Q2JQ133S