BDBM313218 US10166249, Example 448
SMILES: CCCCCOCC1CCc2cc(ccc2C1)[C@H]1CC[C@](N)(COP(O)(O)=O)C1
InChI Key: InChIKey=FGTVMGUXDDFJPX-UOKKUGRISA-N
Data: 1 IC50  3 EC50
Activity Spreadsheet -- Enzyme Inhibition Constant Data from BindingDB
Found 4 hits for monomerid = 313218
Trg + Lig
Ki
nM
ΔG°
kcal/mole
IC50
nM
Kd
nM
EC50/IC50
nM
koff
s-1
kon
M-1s-1
pHTemp
°C
Sphingosine-1-phosphate lyase 1
(Homo sapiens (Human))
BDBM313218
(US10166249, Example 448)
Show SMILES CCCCCOCC1CCc2cc(ccc2C1)[C@H]1CC[C@](N)(COP(O)(O)=O)C1 |r|
Show InChI InChI=1S/C22H36NO5P/c1-2-3-4-11-27-15-17-5-6-19-13-20(8-7-18(19)12-17)21-9-10-22(23,14-21)16-28-29(24,25)26/h7-8,13,17,21H,2-6,9-12,14-16,23H2,1H3,(H2,24,25,26)/t17?,21-,22+/m0/s1
US Patent
n/an/a<10n/an/an/an/an/an/a
Bristol-Myers Squibb Company
US Patent
Assay Description
Membranes were prepared from CHO cells expressing human S1P1. Cells pellets (1×109 cells/pellet) were suspended in buffer containing 20 mM HEPES (4-(...
US Patent US10166249 (2019)
BindingDB Entry DOI: 10.7270/Q2S75JCM
Sphingosine 1-phosphate receptor 3
(Homo sapiens (Human))
BDBM313218
(US10166249, Example 448)
Show SMILES CCCCCOCC1CCc2cc(ccc2C1)[C@H]1CC[C@](N)(COP(O)(O)=O)C1 |r|
Show InChI InChI=1S/C22H36NO5P/c1-2-3-4-11-27-15-17-5-6-19-13-20(8-7-18(19)12-17)21-9-10-22(23,14-21)16-28-29(24,25)26/h7-8,13,17,21H,2-6,9-12,14-16,23H2,1H3,(H2,24,25,26)/t17?,21-,22+/m0/s1
NCI pathway
Reactome pathway
US Patent
n/an/an/an/a>625n/an/an/an/a
Bristol-Myers Squibb Company
US Patent
Assay Description
Compounds were loaded in a 384 Falcon v-bottom plate (0.5 l/well in a 11 point, 3-fold dilution). Membranes prepared from S1P1/CHO cells or EDG3-Gal5...
US Patent US10166249 (2019)
BindingDB Entry DOI: 10.7270/Q2S75JCM
Sphingosine-1-phosphate lyase 1
(Homo sapiens (Human))
BDBM313218
(US10166249, Example 448)
Show SMILES CCCCCOCC1CCc2cc(ccc2C1)[C@H]1CC[C@](N)(COP(O)(O)=O)C1 |r|
Show InChI InChI=1S/C22H36NO5P/c1-2-3-4-11-27-15-17-5-6-19-13-20(8-7-18(19)12-17)21-9-10-22(23,14-21)16-28-29(24,25)26/h7-8,13,17,21H,2-6,9-12,14-16,23H2,1H3,(H2,24,25,26)/t17?,21-,22+/m0/s1
US Patent
n/an/an/an/a<10n/an/an/an/a
Bristol-Myers Squibb Company
US Patent
Assay Description
hS1P1/CHO cells were plated into BD Amine 384-well plates the day before the assay. On the day of the assay, growth medium was removed and replaced w...
US Patent US10166249 (2019)
BindingDB Entry DOI: 10.7270/Q2S75JCM
Sphingosine-1-phosphate lyase 1
(Homo sapiens (Human))
BDBM313218
(US10166249, Example 448)
Show SMILES CCCCCOCC1CCc2cc(ccc2C1)[C@H]1CC[C@](N)(COP(O)(O)=O)C1 |r|
Show InChI InChI=1S/C22H36NO5P/c1-2-3-4-11-27-15-17-5-6-19-13-20(8-7-18(19)12-17)21-9-10-22(23,14-21)16-28-29(24,25)26/h7-8,13,17,21H,2-6,9-12,14-16,23H2,1H3,(H2,24,25,26)/t17?,21-,22+/m0/s1
US Patent
n/an/an/an/a<10n/an/an/an/a
Bristol-Myers Squibb Company
US Patent
Assay Description
Compounds were loaded in a 384 Falcon v-bottom plate (0.5 l/well in a 11 point, 3-fold dilution). Membranes prepared from S1P1/CHO cells or EDG3-Gal5...
US Patent US10166249 (2019)
BindingDB Entry DOI: 10.7270/Q2S75JCM