BDBM313758 US10167285, Example 3
SMILES: COc1ccc(Cl)c(SC2Nc3cncnc3N2CCOC(C)C)c1Cl
InChI Key: InChIKey=ANLIFQHDYCRIOL-UHFFFAOYSA-N
Data: 2 IC50  1 EC50
Activity Spreadsheet -- Enzyme Inhibition Constant Data from BindingDB
Found 3 hits for monomerid = 313758
Trg + Lig
Ki
nM
ΔG°
kcal/mole
IC50
nM
Kd
nM
EC50/IC50
nM
koff
s-1
kon
M-1s-1
pHTemp
°C
Heat shock protein HSP 90-alpha
(Homo sapiens (Human))
BDBM313758
(US10167285, Example 3)
Show SMILES COc1ccc(Cl)c(SC2Nc3cncnc3N2CCOC(C)C)c1Cl
Show InChI InChI=1S/C17H20Cl2N4O2S/c1-10(2)25-7-6-23-16-12(8-20-9-21-16)22-17(23)26-15-11(18)4-5-13(24-3)14(15)19/h4-5,8-10,17,22H,6-7H2,1-3H3
NCI pathway
Reactome pathway
US Patent
n/an/an/an/a 5.00E+3n/an/an/an/a
Memorial Sloan Kettering Cancer Center
US Patent
Assay Description
The biochemical assay tests competitive binding of compounds to recombinant Hsp90α protein and also Hsp90 found in cell specific complexes, and ...
US Patent US10167285 (2019)
BindingDB Entry DOI: 10.7270/Q2BZ684R
Receptor tyrosine-protein kinase erbB-2
(Homo sapiens (Human))
BDBM313758
(US10167285, Example 3)
Show SMILES COc1ccc(Cl)c(SC2Nc3cncnc3N2CCOC(C)C)c1Cl
Show InChI InChI=1S/C17H20Cl2N4O2S/c1-10(2)25-7-6-23-16-12(8-20-9-21-16)22-17(23)26-15-11(18)4-5-13(24-3)14(15)19/h4-5,8-10,17,22H,6-7H2,1-3H3
US Patent
n/an/a 1.61E+4n/an/an/an/an/an/a
Memorial Sloan Kettering Cancer Center
US Patent
US Patent US10167285 (2019)
BindingDB Entry DOI: 10.7270/Q2BZ684R
Receptor tyrosine-protein kinase erbB-2
(Homo sapiens (Human))
BDBM313758
(US10167285, Example 3)
Show SMILES COc1ccc(Cl)c(SC2Nc3cncnc3N2CCOC(C)C)c1Cl
Show InChI InChI=1S/C17H20Cl2N4O2S/c1-10(2)25-7-6-23-16-12(8-20-9-21-16)22-17(23)26-15-11(18)4-5-13(24-3)14(15)19/h4-5,8-10,17,22H,6-7H2,1-3H3
US Patent
n/an/a 5.83E+4n/an/an/an/an/an/a
Memorial Sloan Kettering Cancer Center
US Patent
US Patent US10167285 (2019)
BindingDB Entry DOI: 10.7270/Q2BZ684R