BDBM314059 US9610264, Compound 1
SMILES: O=C(CCc1ccccc1)Nc1ccccc1C(=O)NCc1ccccc1
InChI Key: InChIKey=UVGIBYJYUGXORP-UHFFFAOYSA-N
Data: 1 IC50
Activity Spreadsheet -- Enzyme Inhibition Constant Data from BindingDB
Found 1 hit for monomerid = 314059
Trg + Lig
Ki
nM
ΔG°
kcal/mole
IC50
nM
Kd
nM
EC50/IC50
nM
koff
s-1
kon
M-1s-1
pHTemp
°C
Integrin α4β7
(Homo sapiens (Human))
BDBM314059
(US9610264, Compound 1)
Show SMILES O=C(CCc1ccccc1)Nc1ccccc1C(=O)NCc1ccccc1
Show InChI InChI=1S/C23H22N2O2/c26-22(16-15-18-9-3-1-4-10-18)25-21-14-8-7-13-20(21)23(27)24-17-19-11-5-2-6-12-19/h1-14H,15-17H2,(H,24,27)(H,25,26)
NCI pathway
Reactome pathway
US Patent
n/an/a 0.330n/an/an/an/an/an/a
KFLP BIOTECH, LLC
US Patent
Assay Description
The studies began by screening for the optimal protein concentrations for the method. The studies were conducted in goat anti-mouse IgG coated black ...
US Patent US9610264 (2017)
BindingDB Entry DOI: 10.7270/Q2KH0QD4