null
SMILES: CN[C@H]1C[C@H]2[C@@H]3CC=C(c4cccnc4)[C@@]3(C)CC[C@@H]2[C@@]2(C)CC[C@H](O)CC12
InChI Key: InChIKey=OEHOKGCCAHQPEL-AQFSJHRDSA-N
Activity Spreadsheet -- Enzyme Inhibition Constant Data from BindingDB
Found 1 hit for monomerid = 314735
Trg + Lig
Ki
nM
ΔG°
kcal/mole
IC50
nM
Kd
nM
EC50/IC50
nM
koff
s-1
kon
M-1s-1
pHTemp
°C
Steroid 17-alpha-hydroxylase/17,20 lyase
(Homo sapiens (Human))
BDBM314735
(US9611270, Example 32)
Show SMILES CN[C@H]1C[C@H]2[C@@H]3CC=C(c4cccnc4)[C@@]3(C)CC[C@@H]2[C@@]2(C)CC[C@H](O)CC12 |r,t:7|
Show InChI InChI=1S/C25H36N2O/c1-24-11-9-21-18(20(24)7-6-19(24)16-5-4-12-27-15-16)14-23(26-3)22-13-17(28)8-10-25(21,22)2/h4-6,12,15,17-18,20-23,26,28H,7-11,13-14H2,1-3H3/t17-,18-,20-,21-,22?,23-,24+,25+/m0/s1
Reactome pathway
US Patent
n/an/a 3n/an/an/an/an/an/a
UNIVERSITY OF KANSAS
US Patent
Assay Description
Complementary assays were utilized for the quantitative comparison of compound activity data for CYP17A1 and CYP21A2. Progesterone is a substrate for...
US Patent US9611270 (2017)
BindingDB Entry DOI: 10.7270/Q2CV4KTZ