BDBM3154 2-({2,6-dihydroxy-4-[({3-[(4-hydroxybenzene)amido]bicyclo[2.2.1]heptan-2-yl}oxy)carbonyl]phenyl}carbonyl)-3-hydroxybenzoic acid::Balanol analog 20::Balanol analog 21
SMILES: OC(=O)c1cccc(O)c1C(=O)c1c(O)cc(cc1O)C(=O)OC1C2CCC(C2)C1NC(=O)c1ccc(O)cc1
InChI Key: InChIKey=GQCWIZZVARXZGR-UHFFFAOYSA-N
Data: 19 IC50
Activity Spreadsheet -- Enzyme Inhibition Constant Data from BindingDB
Found 19 hits for monomerid = 3154
Trg + Lig
Ki
nM
ΔG°
kcal/mole
IC50
nM
Kd
nM
EC50/IC50
nM
koff
s-1
kon
M-1s-1
pHTemp
°C
Protein kinase C alpha type
(Homo sapiens (Human))
BDBM3154
(2-({2,6-dihydroxy-4-[({3-[(4-hydroxybenzene)amido]...)
Show SMILES OC(=O)c1cccc(O)c1C(=O)c1c(O)cc(cc1O)C(=O)OC1C2CCC(C2)C1NC(=O)c1ccc(O)cc1 |THB:22:23:25.26:28,30:29:25.26:28|
Show InChI InChI=1S/C29H25NO10/c31-17-8-6-13(7-9-17)27(36)30-24-14-4-5-15(10-14)26(24)40-29(39)16-11-20(33)23(21(34)12-16)25(35)22-18(28(37)38)2-1-3-19(22)32/h1-3,6-9,11-12,14-15,24,26,31-34H,4-5,10H2,(H,30,36)(H,37,38)
NCI pathway
Reactome pathway
n/an/a 55n/an/an/an/a7.530
Sphinx Laboratories
Assay Description
PKC was assayed by quantitating the incorporation of 32P from [gamma-32P]ATP into histone type IIIs.
Bioorg Med Chem Lett 5: 2211-6 (1995)
Article DOI: 10.1016/0960-894X(95)00382-4
BindingDB Entry DOI: 10.7270/Q2QR4V9M
cAMP-dependent protein kinase (PKA)
(Homo sapiens (Human))
BDBM3154
(2-({2,6-dihydroxy-4-[({3-[(4-hydroxybenzene)amido]...)
Show SMILES OC(=O)c1cccc(O)c1C(=O)c1c(O)cc(cc1O)C(=O)OC1C2CCC(C2)C1NC(=O)c1ccc(O)cc1 |THB:22:23:25.26:28,30:29:25.26:28|
Show InChI InChI=1S/C29H25NO10/c31-17-8-6-13(7-9-17)27(36)30-24-14-4-5-15(10-14)26(24)40-29(39)16-11-20(33)23(21(34)12-16)25(35)22-18(28(37)38)2-1-3-19(22)32/h1-3,6-9,11-12,14-15,24,26,31-34H,4-5,10H2,(H,30,36)(H,37,38)
n/an/a 1.90E+3n/an/an/an/an/an/a
Sphinx Laboratories
Assay Description
Inhibition of Protein kinase C beta 2
Bioorg Med Chem Lett 5: 2211-6 (1995)
Article DOI: 10.1016/0960-894X(95)00382-4
BindingDB Entry DOI: 10.7270/Q2QR4V9M
PKC alpha and beta-2
(Homo sapiens (Human))
BDBM3154
(2-({2,6-dihydroxy-4-[({3-[(4-hydroxybenzene)amido]...)
Show SMILES OC(=O)c1cccc(O)c1C(=O)c1c(O)cc(cc1O)C(=O)OC1C2CCC(C2)C1NC(=O)c1ccc(O)cc1 |THB:22:23:25.26:28,30:29:25.26:28|
Show InChI InChI=1S/C29H25NO10/c31-17-8-6-13(7-9-17)27(36)30-24-14-4-5-15(10-14)26(24)40-29(39)16-11-20(33)23(21(34)12-16)25(35)22-18(28(37)38)2-1-3-19(22)32/h1-3,6-9,11-12,14-15,24,26,31-34H,4-5,10H2,(H,30,36)(H,37,38)
NCI pathway
Reactome pathway
n/an/a 45n/an/an/an/a7.530
Sphinx Laboratories
Assay Description
PKC was assayed by quantitating the incorporation of 32P from [gamma-32P]ATP into histone type IIIs.
Bioorg Med Chem Lett 5: 2211-6 (1995)
Article DOI: 10.1016/0960-894X(95)00382-4
BindingDB Entry DOI: 10.7270/Q2QR4V9M
PKC alpha and beta-2
(Homo sapiens (Human))
BDBM3154
(2-({2,6-dihydroxy-4-[({3-[(4-hydroxybenzene)amido]...)
Show SMILES OC(=O)c1cccc(O)c1C(=O)c1c(O)cc(cc1O)C(=O)OC1C2CCC(C2)C1NC(=O)c1ccc(O)cc1 |THB:22:23:25.26:28,30:29:25.26:28|
Show InChI InChI=1S/C29H25NO10/c31-17-8-6-13(7-9-17)27(36)30-24-14-4-5-15(10-14)26(24)40-29(39)16-11-20(33)23(21(34)12-16)25(35)22-18(28(37)38)2-1-3-19(22)32/h1-3,6-9,11-12,14-15,24,26,31-34H,4-5,10H2,(H,30,36)(H,37,38)
NCI pathway
Reactome pathway
n/an/a 1.70E+4n/an/an/an/a7.530
Sphinx Laboratories
Assay Description
PKC was assayed by quantitating the incorporation of 32P from [gamma-32P]ATP into histone type IIIs.
Bioorg Med Chem Lett 5: 2211-6 (1995)
Article DOI: 10.1016/0960-894X(95)00382-4
BindingDB Entry DOI: 10.7270/Q2QR4V9M
PKC alpha and beta-2
(Homo sapiens (Human))
BDBM3154
(2-({2,6-dihydroxy-4-[({3-[(4-hydroxybenzene)amido]...)
Show SMILES OC(=O)c1cccc(O)c1C(=O)c1c(O)cc(cc1O)C(=O)OC1C2CCC(C2)C1NC(=O)c1ccc(O)cc1 |THB:22:23:25.26:28,30:29:25.26:28|
Show InChI InChI=1S/C29H25NO10/c31-17-8-6-13(7-9-17)27(36)30-24-14-4-5-15(10-14)26(24)40-29(39)16-11-20(33)23(21(34)12-16)25(35)22-18(28(37)38)2-1-3-19(22)32/h1-3,6-9,11-12,14-15,24,26,31-34H,4-5,10H2,(H,30,36)(H,37,38)
NCI pathway
Reactome pathway
n/an/a 30n/an/an/an/a7.530
Sphinx Laboratories
Assay Description
PKC was assayed by quantitating the incorporation of 32P from [gamma-32P]ATP into histone type IIIs.
Bioorg Med Chem Lett 5: 2211-6 (1995)
Article DOI: 10.1016/0960-894X(95)00382-4
BindingDB Entry DOI: 10.7270/Q2QR4V9M
PKC alpha and beta-2
(Homo sapiens (Human))
BDBM3154
(2-({2,6-dihydroxy-4-[({3-[(4-hydroxybenzene)amido]...)
Show SMILES OC(=O)c1cccc(O)c1C(=O)c1c(O)cc(cc1O)C(=O)OC1C2CCC(C2)C1NC(=O)c1ccc(O)cc1 |THB:22:23:25.26:28,30:29:25.26:28|
Show InChI InChI=1S/C29H25NO10/c31-17-8-6-13(7-9-17)27(36)30-24-14-4-5-15(10-14)26(24)40-29(39)16-11-20(33)23(21(34)12-16)25(35)22-18(28(37)38)2-1-3-19(22)32/h1-3,6-9,11-12,14-15,24,26,31-34H,4-5,10H2,(H,30,36)(H,37,38)
NCI pathway
Reactome pathway
n/an/a 6.90E+3n/an/an/an/a7.530
Sphinx Laboratories
Assay Description
PKC was assayed by quantitating the incorporation of 32P from [gamma-32P]ATP into histone type IIIs.
Bioorg Med Chem Lett 5: 2211-6 (1995)
Article DOI: 10.1016/0960-894X(95)00382-4
BindingDB Entry DOI: 10.7270/Q2QR4V9M
Protein kinase C, gamma
(Homo sapiens (Human))
BDBM3154
(2-({2,6-dihydroxy-4-[({3-[(4-hydroxybenzene)amido]...)
Show SMILES OC(=O)c1cccc(O)c1C(=O)c1c(O)cc(cc1O)C(=O)OC1C2CCC(C2)C1NC(=O)c1ccc(O)cc1 |THB:22:23:25.26:28,30:29:25.26:28|
Show InChI InChI=1S/C29H25NO10/c31-17-8-6-13(7-9-17)27(36)30-24-14-4-5-15(10-14)26(24)40-29(39)16-11-20(33)23(21(34)12-16)25(35)22-18(28(37)38)2-1-3-19(22)32/h1-3,6-9,11-12,14-15,24,26,31-34H,4-5,10H2,(H,30,36)(H,37,38)
NCI pathway
Reactome pathway
n/an/a 35n/an/an/an/an/an/a
Sphinx Laboratories
Assay Description
PKC was assayed by quantitating the incorporation of 32P from [gamma-32P]ATP into histone type IIIs.
Bioorg Med Chem Lett 5: 2211-6 (1995)
Article DOI: 10.1016/0960-894X(95)00382-4
BindingDB Entry DOI: 10.7270/Q2QR4V9M
Protein kinase C, gamma
(Homo sapiens (Human))
BDBM3154
(2-({2,6-dihydroxy-4-[({3-[(4-hydroxybenzene)amido]...)
Show SMILES OC(=O)c1cccc(O)c1C(=O)c1c(O)cc(cc1O)C(=O)OC1C2CCC(C2)C1NC(=O)c1ccc(O)cc1 |THB:22:23:25.26:28,30:29:25.26:28|
Show InChI InChI=1S/C29H25NO10/c31-17-8-6-13(7-9-17)27(36)30-24-14-4-5-15(10-14)26(24)40-29(39)16-11-20(33)23(21(34)12-16)25(35)22-18(28(37)38)2-1-3-19(22)32/h1-3,6-9,11-12,14-15,24,26,31-34H,4-5,10H2,(H,30,36)(H,37,38)
NCI pathway
Reactome pathway
n/an/a 1.00E+4n/an/an/an/an/an/a
Sphinx Laboratories
Assay Description
PKC was assayed by quantitating the incorporation of 32P from [gamma-32P]ATP into histone type IIIs.
Bioorg Med Chem Lett 5: 2211-6 (1995)
Article DOI: 10.1016/0960-894X(95)00382-4
BindingDB Entry DOI: 10.7270/Q2QR4V9M
Protein kinase C delta type
(Homo sapiens (Human))
BDBM3154
(2-({2,6-dihydroxy-4-[({3-[(4-hydroxybenzene)amido]...)
Show SMILES OC(=O)c1cccc(O)c1C(=O)c1c(O)cc(cc1O)C(=O)OC1C2CCC(C2)C1NC(=O)c1ccc(O)cc1 |THB:22:23:25.26:28,30:29:25.26:28|
Show InChI InChI=1S/C29H25NO10/c31-17-8-6-13(7-9-17)27(36)30-24-14-4-5-15(10-14)26(24)40-29(39)16-11-20(33)23(21(34)12-16)25(35)22-18(28(37)38)2-1-3-19(22)32/h1-3,6-9,11-12,14-15,24,26,31-34H,4-5,10H2,(H,30,36)(H,37,38)
NCI pathway
Reactome pathway
n/an/a 20n/an/an/an/an/an/a
Sphinx Laboratories
Assay Description
PKC was assayed by quantitating the incorporation of 32P from [gamma-32P]ATP into histone type IIIs.
Bioorg Med Chem Lett 5: 2211-6 (1995)
Article DOI: 10.1016/0960-894X(95)00382-4
BindingDB Entry DOI: 10.7270/Q2QR4V9M
Protein kinase C delta type
(Homo sapiens (Human))
BDBM3154
(2-({2,6-dihydroxy-4-[({3-[(4-hydroxybenzene)amido]...)
Show SMILES OC(=O)c1cccc(O)c1C(=O)c1c(O)cc(cc1O)C(=O)OC1C2CCC(C2)C1NC(=O)c1ccc(O)cc1 |THB:22:23:25.26:28,30:29:25.26:28|
Show InChI InChI=1S/C29H25NO10/c31-17-8-6-13(7-9-17)27(36)30-24-14-4-5-15(10-14)26(24)40-29(39)16-11-20(33)23(21(34)12-16)25(35)22-18(28(37)38)2-1-3-19(22)32/h1-3,6-9,11-12,14-15,24,26,31-34H,4-5,10H2,(H,30,36)(H,37,38)
NCI pathway
Reactome pathway
n/an/a 3.50E+3n/an/an/an/an/an/a
Sphinx Laboratories
Assay Description
PKC was assayed by quantitating the incorporation of 32P from [gamma-32P]ATP into histone type IIIs.
Bioorg Med Chem Lett 5: 2211-6 (1995)
Article DOI: 10.1016/0960-894X(95)00382-4
BindingDB Entry DOI: 10.7270/Q2QR4V9M
Protein kinase C, epsilon
(Homo sapiens (Human))
BDBM3154
(2-({2,6-dihydroxy-4-[({3-[(4-hydroxybenzene)amido]...)
Show SMILES OC(=O)c1cccc(O)c1C(=O)c1c(O)cc(cc1O)C(=O)OC1C2CCC(C2)C1NC(=O)c1ccc(O)cc1 |THB:22:23:25.26:28,30:29:25.26:28|
Show InChI InChI=1S/C29H25NO10/c31-17-8-6-13(7-9-17)27(36)30-24-14-4-5-15(10-14)26(24)40-29(39)16-11-20(33)23(21(34)12-16)25(35)22-18(28(37)38)2-1-3-19(22)32/h1-3,6-9,11-12,14-15,24,26,31-34H,4-5,10H2,(H,30,36)(H,37,38)
NCI pathway
Reactome pathway
n/an/a 30n/an/an/an/an/an/a
Sphinx Laboratories
Assay Description
PKC was assayed by quantitating the incorporation of 32P from [gamma-32P]ATP into histone type IIIs.
Bioorg Med Chem Lett 5: 2211-6 (1995)
Article DOI: 10.1016/0960-894X(95)00382-4
BindingDB Entry DOI: 10.7270/Q2QR4V9M
Protein kinase C, epsilon
(Homo sapiens (Human))
BDBM3154
(2-({2,6-dihydroxy-4-[({3-[(4-hydroxybenzene)amido]...)
Show SMILES OC(=O)c1cccc(O)c1C(=O)c1c(O)cc(cc1O)C(=O)OC1C2CCC(C2)C1NC(=O)c1ccc(O)cc1 |THB:22:23:25.26:28,30:29:25.26:28|
Show InChI InChI=1S/C29H25NO10/c31-17-8-6-13(7-9-17)27(36)30-24-14-4-5-15(10-14)26(24)40-29(39)16-11-20(33)23(21(34)12-16)25(35)22-18(28(37)38)2-1-3-19(22)32/h1-3,6-9,11-12,14-15,24,26,31-34H,4-5,10H2,(H,30,36)(H,37,38)
NCI pathway
Reactome pathway
n/an/a 1.50E+3n/an/an/an/an/an/a
Sphinx Laboratories
Assay Description
PKC was assayed by quantitating the incorporation of 32P from [gamma-32P]ATP into histone type IIIs.
Bioorg Med Chem Lett 5: 2211-6 (1995)
Article DOI: 10.1016/0960-894X(95)00382-4
BindingDB Entry DOI: 10.7270/Q2QR4V9M
Protein kinase C, eta
(Homo sapiens (Human))
BDBM3154
(2-({2,6-dihydroxy-4-[({3-[(4-hydroxybenzene)amido]...)
Show SMILES OC(=O)c1cccc(O)c1C(=O)c1c(O)cc(cc1O)C(=O)OC1C2CCC(C2)C1NC(=O)c1ccc(O)cc1 |THB:22:23:25.26:28,30:29:25.26:28|
Show InChI InChI=1S/C29H25NO10/c31-17-8-6-13(7-9-17)27(36)30-24-14-4-5-15(10-14)26(24)40-29(39)16-11-20(33)23(21(34)12-16)25(35)22-18(28(37)38)2-1-3-19(22)32/h1-3,6-9,11-12,14-15,24,26,31-34H,4-5,10H2,(H,30,36)(H,37,38)
NCI pathway
Reactome pathway
n/an/a 20n/an/an/an/an/an/a
Sphinx Laboratories
Assay Description
PKC was assayed by quantitating the incorporation of 32P from [gamma-32P]ATP into histone type IIIs.
Bioorg Med Chem Lett 5: 2211-6 (1995)
Article DOI: 10.1016/0960-894X(95)00382-4
BindingDB Entry DOI: 10.7270/Q2QR4V9M
Protein kinase C, eta
(Homo sapiens (Human))
BDBM3154
(2-({2,6-dihydroxy-4-[({3-[(4-hydroxybenzene)amido]...)
Show SMILES OC(=O)c1cccc(O)c1C(=O)c1c(O)cc(cc1O)C(=O)OC1C2CCC(C2)C1NC(=O)c1ccc(O)cc1 |THB:22:23:25.26:28,30:29:25.26:28|
Show InChI InChI=1S/C29H25NO10/c31-17-8-6-13(7-9-17)27(36)30-24-14-4-5-15(10-14)26(24)40-29(39)16-11-20(33)23(21(34)12-16)25(35)22-18(28(37)38)2-1-3-19(22)32/h1-3,6-9,11-12,14-15,24,26,31-34H,4-5,10H2,(H,30,36)(H,37,38)
NCI pathway
Reactome pathway
n/an/a 4.50E+3n/an/an/an/an/an/a
Sphinx Laboratories
Assay Description
PKC was assayed by quantitating the incorporation of 32P from [gamma-32P]ATP into histone type IIIs.
Bioorg Med Chem Lett 5: 2211-6 (1995)
Article DOI: 10.1016/0960-894X(95)00382-4
BindingDB Entry DOI: 10.7270/Q2QR4V9M
Protein kinase C (PKC)
(Homo sapiens (Human))
BDBM3154
(2-({2,6-dihydroxy-4-[({3-[(4-hydroxybenzene)amido]...)
Show SMILES OC(=O)c1cccc(O)c1C(=O)c1c(O)cc(cc1O)C(=O)OC1C2CCC(C2)C1NC(=O)c1ccc(O)cc1 |THB:22:23:25.26:28,30:29:25.26:28|
Show InChI InChI=1S/C29H25NO10/c31-17-8-6-13(7-9-17)27(36)30-24-14-4-5-15(10-14)26(24)40-29(39)16-11-20(33)23(21(34)12-16)25(35)22-18(28(37)38)2-1-3-19(22)32/h1-3,6-9,11-12,14-15,24,26,31-34H,4-5,10H2,(H,30,36)(H,37,38)
NCI pathway
Reactome pathway
n/an/a 3.70E+4n/an/an/an/an/an/a
Sphinx Laboratories
Assay Description
PKC was assayed by quantitating the incorporation of 32P from [gamma-32P]ATP into histone type IIIs.
Bioorg Med Chem Lett 5: 2211-6 (1995)
Article DOI: 10.1016/0960-894X(95)00382-4
BindingDB Entry DOI: 10.7270/Q2QR4V9M
Protein kinase C (PKC)
(Homo sapiens (Human))
BDBM3154
(2-({2,6-dihydroxy-4-[({3-[(4-hydroxybenzene)amido]...)
Show SMILES OC(=O)c1cccc(O)c1C(=O)c1c(O)cc(cc1O)C(=O)OC1C2CCC(C2)C1NC(=O)c1ccc(O)cc1 |THB:22:23:25.26:28,30:29:25.26:28|
Show InChI InChI=1S/C29H25NO10/c31-17-8-6-13(7-9-17)27(36)30-24-14-4-5-15(10-14)26(24)40-29(39)16-11-20(33)23(21(34)12-16)25(35)22-18(28(37)38)2-1-3-19(22)32/h1-3,6-9,11-12,14-15,24,26,31-34H,4-5,10H2,(H,30,36)(H,37,38)
NCI pathway
Reactome pathway
n/an/a>5.00E+4n/an/an/an/an/an/a
Sphinx Laboratories
Assay Description
PKC was assayed by quantitating the incorporation of 32P from [gamma-32P]ATP into histone type IIIs.
Bioorg Med Chem Lett 5: 2211-6 (1995)
Article DOI: 10.1016/0960-894X(95)00382-4
BindingDB Entry DOI: 10.7270/Q2QR4V9M
cAMP-Dependent Protein Kinase (PKA)
(Bos taurus (bovine))
BDBM3154
(2-({2,6-dihydroxy-4-[({3-[(4-hydroxybenzene)amido]...)
Show SMILES OC(=O)c1cccc(O)c1C(=O)c1c(O)cc(cc1O)C(=O)OC1C2CCC(C2)C1NC(=O)c1ccc(O)cc1 |THB:22:23:25.26:28,30:29:25.26:28|
Show InChI InChI=1S/C29H25NO10/c31-17-8-6-13(7-9-17)27(36)30-24-14-4-5-15(10-14)26(24)40-29(39)16-11-20(33)23(21(34)12-16)25(35)22-18(28(37)38)2-1-3-19(22)32/h1-3,6-9,11-12,14-15,24,26,31-34H,4-5,10H2,(H,30,36)(H,37,38)
n/an/a 1.90E+3n/an/an/an/an/an/a
Sphinx Laboratories
Assay Description
The activity of PKA, activated by cAMP, is measured by its ability to transfer phosphate from [gamma-32P]ATP to histone.
Bioorg Med Chem Lett 5: 2211-6 (1995)
Article DOI: 10.1016/0960-894X(95)00382-4
BindingDB Entry DOI: 10.7270/Q2QR4V9M
cAMP-Dependent Protein Kinase (PKA)
(Bos taurus (bovine))
BDBM3154
(2-({2,6-dihydroxy-4-[({3-[(4-hydroxybenzene)amido]...)
Show SMILES OC(=O)c1cccc(O)c1C(=O)c1c(O)cc(cc1O)C(=O)OC1C2CCC(C2)C1NC(=O)c1ccc(O)cc1 |THB:22:23:25.26:28,30:29:25.26:28|
Show InChI InChI=1S/C29H25NO10/c31-17-8-6-13(7-9-17)27(36)30-24-14-4-5-15(10-14)26(24)40-29(39)16-11-20(33)23(21(34)12-16)25(35)22-18(28(37)38)2-1-3-19(22)32/h1-3,6-9,11-12,14-15,24,26,31-34H,4-5,10H2,(H,30,36)(H,37,38)
n/an/a>5.00E+4n/an/an/an/an/an/a
Sphinx Laboratories
Assay Description
The activity of PKA, activated by cAMP, is measured by its ability to transfer phosphate from [gamma-32P]ATP to histone.
Bioorg Med Chem Lett 5: 2211-6 (1995)
Article DOI: 10.1016/0960-894X(95)00382-4
BindingDB Entry DOI: 10.7270/Q2QR4V9M
Protein kinase C alpha type
(Homo sapiens (Human))
BDBM3154
(2-({2,6-dihydroxy-4-[({3-[(4-hydroxybenzene)amido]...)
Show SMILES OC(=O)c1cccc(O)c1C(=O)c1c(O)cc(cc1O)C(=O)OC1C2CCC(C2)C1NC(=O)c1ccc(O)cc1 |THB:22:23:25.26:28,30:29:25.26:28|
Show InChI InChI=1S/C29H25NO10/c31-17-8-6-13(7-9-17)27(36)30-24-14-4-5-15(10-14)26(24)40-29(39)16-11-20(33)23(21(34)12-16)25(35)22-18(28(37)38)2-1-3-19(22)32/h1-3,6-9,11-12,14-15,24,26,31-34H,4-5,10H2,(H,30,36)(H,37,38)
NCI pathway
Reactome pathway
n/an/a 2.40E+4n/an/an/an/a7.530
Sphinx Laboratories
Assay Description
PKC was assayed by quantitating the incorporation of 32P from [gamma-32P]ATP into histone type IIIs.
Bioorg Med Chem Lett 5: 2211-6 (1995)
Article DOI: 10.1016/0960-894X(95)00382-4
BindingDB Entry DOI: 10.7270/Q2QR4V9M