BDBM31550 pyrazolo[4,3-h]quinazoline-3-carboxamide, 33
SMILES: CNC(=O)c1nn(C)c-2c1C(C)(C)Cc1cnc(Nc3cccc(OC4CCN(C)CC4)c3)nc-21
InChI Key: InChIKey=KEVSDOAMFUXCEG-UHFFFAOYSA-N
Data: 2 IC50
Activity Spreadsheet -- Enzyme Inhibition Constant Data from BindingDB
Found 2 hits for monomerid = 31550
Trg + Lig
Ki
nM
ΔG°
kcal/mole
IC50
nM
Kd
nM
EC50/IC50
nM
koff
s-1
kon
M-1s-1
pHTemp
°C
Aurora kinase A
(Homo sapiens (Human))
BDBM31550
(pyrazolo[4,3-h]quinazoline-3-carboxamide, 33)
Show SMILES CNC(=O)c1nn(C)c-2c1C(C)(C)Cc1cnc(Nc3cccc(OC4CCN(C)CC4)c3)nc-21
Show InChI InChI=1S/C26H33N7O2/c1-26(2)14-16-15-28-25(30-21(16)23-20(26)22(24(34)27-3)31-33(23)5)29-17-7-6-8-19(13-17)35-18-9-11-32(4)12-10-18/h6-8,13,15,18H,9-12,14H2,1-5H3,(H,27,34)(H,28,29,30)
NCI pathway
Reactome pathway
n/an/a 1.58E+3n/an/an/an/an/a25
Nerviano Medical Sciences Srl
Assay Description
The biochemical activity of compounds was determined by incubation with specific enzymes and substrates, followed by quantitation of the phosphorylat...
J Med Chem 52: 5152-63 (2009)
Article DOI: 10.1021/jm9006559
BindingDB Entry DOI: 10.7270/Q2JH3JJP
Cyclin-A2/Cyclin-dependent kinase 2
(Homo sapiens (Human))
BDBM31550
(pyrazolo[4,3-h]quinazoline-3-carboxamide, 33)
Show SMILES CNC(=O)c1nn(C)c-2c1C(C)(C)Cc1cnc(Nc3cccc(OC4CCN(C)CC4)c3)nc-21
Show InChI InChI=1S/C26H33N7O2/c1-26(2)14-16-15-28-25(30-21(16)23-20(26)22(24(34)27-3)31-33(23)5)29-17-7-6-8-19(13-17)35-18-9-11-32(4)12-10-18/h6-8,13,15,18H,9-12,14H2,1-5H3,(H,27,34)(H,28,29,30)
NCI pathway
Reactome pathway
n/an/a 47n/an/an/an/a7.423
Nerviano Medical Sciences Srl
Assay Description
The biochemical activity of compounds was determined by incubation with specific enzymes and substrates, followed by quantitation of the phosphorylat...
J Med Chem 52: 5152-63 (2009)
Article DOI: 10.1021/jm9006559
BindingDB Entry DOI: 10.7270/Q2JH3JJP