BDBM315544 US10172858, Table 2.39::US9828378, # 39
SMILES: CC(C)n1nc(-c2cc3c(Cl)ccc(O)c3[nH]2)c2c(N)ncnc12
InChI Key: InChIKey=UFNFSEDETAYKQV-UHFFFAOYSA-N
Data: 8 IC50
Activity Spreadsheet -- Enzyme Inhibition Constant Data from BindingDB
Found 8 hits for monomerid = 315544
Trg + Lig
Ki
nM
ΔG°
kcal/mole
IC50
nM
Kd
nM
EC50/IC50
nM
koff
s-1
kon
M-1s-1
pHTemp
°C
Serine/threonine-protein kinase mTOR
(Homo sapiens (Human))
BDBM315544
(US10172858, Table 2.39 | US9828378, # 39)
Show SMILES CC(C)n1nc(-c2cc3c(Cl)ccc(O)c3[nH]2)c2c(N)ncnc12
Show InChI InChI=1S/C16H15ClN6O/c1-7(2)23-16-12(15(18)19-6-20-16)14(22-23)10-5-8-9(17)3-4-11(24)13(8)21-10/h3-7,21,24H,1-2H3,(H2,18,19,20)
NCI pathway
Reactome pathway
US Patent
n/an/a<10n/an/an/an/an/an/a
INTELLIKINE LLC
US Patent
Assay Description
This assay is relatively simple, reasonably sensitive, and the peptide substrate can be adjusted both in terms of sequence and concentration to meet ...
US Patent US10172858 (2019)
BindingDB Entry DOI: 10.7270/Q2736T01
PI3-kinase class I
(Homo sapiens (Human))
BDBM315544
(US10172858, Table 2.39 | US9828378, # 39)
Show SMILES CC(C)n1nc(-c2cc3c(Cl)ccc(O)c3[nH]2)c2c(N)ncnc12
Show InChI InChI=1S/C16H15ClN6O/c1-7(2)23-16-12(15(18)19-6-20-16)14(22-23)10-5-8-9(17)3-4-11(24)13(8)21-10/h3-7,21,24H,1-2H3,(H2,18,19,20)
US Patent
n/an/a>500n/an/an/an/an/an/a
INTELLIKINE LLC
US Patent
Assay Description
This assay is relatively simple, reasonably sensitive, and the peptide substrate can be adjusted both in terms of sequence and concentration to meet ...
US Patent US10172858 (2019)
BindingDB Entry DOI: 10.7270/Q2736T01
Phosphatidylinositol 4,5-bisphosphate 3-kinase catalytic subunit gamma isoform
(Homo sapiens (Human))
BDBM315544
(US10172858, Table 2.39 | US9828378, # 39)
Show SMILES CC(C)n1nc(-c2cc3c(Cl)ccc(O)c3[nH]2)c2c(N)ncnc12
Show InChI InChI=1S/C16H15ClN6O/c1-7(2)23-16-12(15(18)19-6-20-16)14(22-23)10-5-8-9(17)3-4-11(24)13(8)21-10/h3-7,21,24H,1-2H3,(H2,18,19,20)
NCI pathway
Reactome pathway
US Patent
n/an/a>500n/an/an/an/an/an/a
INTELLIKINE LLC
US Patent
Assay Description
This assay is relatively simple, reasonably sensitive, and the peptide substrate can be adjusted both in terms of sequence and concentration to meet ...
US Patent US10172858 (2019)
BindingDB Entry DOI: 10.7270/Q2736T01
Phosphatidylinositol 4,5-bisphosphate 3-kinase catalytic subunit delta isoform
(Homo sapiens (Human))
BDBM315544
(US10172858, Table 2.39 | US9828378, # 39)
Show SMILES CC(C)n1nc(-c2cc3c(Cl)ccc(O)c3[nH]2)c2c(N)ncnc12
Show InChI InChI=1S/C16H15ClN6O/c1-7(2)23-16-12(15(18)19-6-20-16)14(22-23)10-5-8-9(17)3-4-11(24)13(8)21-10/h3-7,21,24H,1-2H3,(H2,18,19,20)
NCI pathway
Reactome pathway
US Patent
n/an/a>500n/an/an/an/an/an/a
Intellikine LLC
US Patent
Assay Description
Class I PI3-Ks can be either purchased (p110α/p85α, p110β/p85α, p110δ/p85α from Upstate, and p110γ from Sigma) or...
US Patent US9828378 (2017)
BindingDB Entry DOI: 10.7270/Q2542QWN
Cytosolic arginine sensor for mTORC1 subunit 1
(Homo sapiens (Human))
BDBM315544
(US10172858, Table 2.39 | US9828378, # 39)
Show SMILES CC(C)n1nc(-c2cc3c(Cl)ccc(O)c3[nH]2)c2c(N)ncnc12
Show InChI InChI=1S/C16H15ClN6O/c1-7(2)23-16-12(15(18)19-6-20-16)14(22-23)10-5-8-9(17)3-4-11(24)13(8)21-10/h3-7,21,24H,1-2H3,(H2,18,19,20)
US Patent
n/an/a<10n/an/an/an/an/an/a
Intellikine LLC
US Patent
Assay Description
Class I PI3-Ks can be either purchased (p110α/p85α, p110β/p85α, p110δ/p85α from Upstate, and p110γ from Sigma) or...
US Patent US9828378 (2017)
BindingDB Entry DOI: 10.7270/Q2542QWN
Phosphatidylinositol 4,5-bisphosphate 3-kinase catalytic subunit alpha isoform
(Homo sapiens (Human))
BDBM315544
(US10172858, Table 2.39 | US9828378, # 39)
Show SMILES CC(C)n1nc(-c2cc3c(Cl)ccc(O)c3[nH]2)c2c(N)ncnc12
Show InChI InChI=1S/C16H15ClN6O/c1-7(2)23-16-12(15(18)19-6-20-16)14(22-23)10-5-8-9(17)3-4-11(24)13(8)21-10/h3-7,21,24H,1-2H3,(H2,18,19,20)
NCI pathway
Reactome pathway
US Patent
n/an/a>500n/an/an/an/an/an/a
Intellikine LLC
US Patent
Assay Description
Class I PI3-Ks can be either purchased (p110α/p85α, p110β/p85α, p110δ/p85α from Upstate, and p110γ from Sigma) or...
US Patent US9828378 (2017)
BindingDB Entry DOI: 10.7270/Q2542QWN
Phosphatidylinositol 4,5-bisphosphate 3-kinase catalytic subunit gamma isoform
(Homo sapiens (Human))
BDBM315544
(US10172858, Table 2.39 | US9828378, # 39)
Show SMILES CC(C)n1nc(-c2cc3c(Cl)ccc(O)c3[nH]2)c2c(N)ncnc12
Show InChI InChI=1S/C16H15ClN6O/c1-7(2)23-16-12(15(18)19-6-20-16)14(22-23)10-5-8-9(17)3-4-11(24)13(8)21-10/h3-7,21,24H,1-2H3,(H2,18,19,20)
NCI pathway
Reactome pathway
US Patent
n/an/a>500n/an/an/an/an/an/a
Intellikine LLC
US Patent
Assay Description
Class I PI3-Ks can be either purchased (p110α/p85α, p110β/p85α, p110δ/p85α from Upstate, and p110γ from Sigma) or...
US Patent US9828378 (2017)
BindingDB Entry DOI: 10.7270/Q2542QWN
Phosphatidylinositol 4,5-bisphosphate 3-kinase catalytic subunit delta isoform
(Homo sapiens (Human))
BDBM315544
(US10172858, Table 2.39 | US9828378, # 39)
Show SMILES CC(C)n1nc(-c2cc3c(Cl)ccc(O)c3[nH]2)c2c(N)ncnc12
Show InChI InChI=1S/C16H15ClN6O/c1-7(2)23-16-12(15(18)19-6-20-16)14(22-23)10-5-8-9(17)3-4-11(24)13(8)21-10/h3-7,21,24H,1-2H3,(H2,18,19,20)
NCI pathway
Reactome pathway
US Patent
n/an/a>500n/an/an/an/an/an/a
INTELLIKINE LLC
US Patent
Assay Description
This assay is relatively simple, reasonably sensitive, and the peptide substrate can be adjusted both in terms of sequence and concentration to meet ...
US Patent US10172858 (2019)
BindingDB Entry DOI: 10.7270/Q2736T01