null
SMILES: CN1CCN(CC1)C1CC(C1)n1nc(-c2cc3cc(O)ccc3[nH]2)c2c(N)ncnc12
InChI Key: InChIKey=ZRPYHIRNXDXHRX-UHFFFAOYSA-N
Activity Spreadsheet -- Enzyme Inhibition Constant Data from BindingDB
Found 10 hits for monomerid = 315555
Trg + Lig
Ki
nM
ΔG°
kcal/mole
IC50
nM
Kd
nM
EC50/IC50
nM
koff
s-1
kon
M-1s-1
pHTemp
°C
Serine/threonine-protein kinase mTOR
(Homo sapiens (Human))
BDBM315555
(US10172858, Table 2.52 | US9828378, # 52)
Show SMILES CN1CCN(CC1)C1CC(C1)n1nc(-c2cc3cc(O)ccc3[nH]2)c2c(N)ncnc12 |(3.02,-10.82,;2.62,-9.33,;1.06,-8.91,;.71,-7.39,;1.8,-6.3,;3.29,-6.7,;3.76,-8.19,;1.4,-4.81,;.07,-4.04,;.84,-2.71,;2.17,-3.48,;.44,-1.22,;1.35,.03,;.44,1.27,;.84,2.76,;-.06,4,;.84,5.25,;.52,6.76,;1.67,7.79,;1.27,9.27,;3.13,7.31,;3.45,5.8,;2.31,4.77,;2.31,3.23,;-1.02,.8,;-2.36,1.57,;-2.36,3.11,;-3.69,.8,;-3.69,-.74,;-2.36,-1.51,;-1.02,-.74,)|
Show InChI InChI=1S/C22H26N8O/c1-28-4-6-29(7-5-28)14-10-15(11-14)30-22-19(21(23)24-12-25-22)20(27-30)18-9-13-8-16(31)2-3-17(13)26-18/h2-3,8-9,12,14-15,26,31H,4-7,10-11H2,1H3,(H2,23,24,25)
NCI pathway
Reactome pathway
US Patent
n/an/a<500n/an/an/an/an/an/a
INTELLIKINE LLC
US Patent
Assay Description
This assay is relatively simple, reasonably sensitive, and the peptide substrate can be adjusted both in terms of sequence and concentration to meet ...
US Patent US10172858 (2019)
BindingDB Entry DOI: 10.7270/Q2736T01
Phosphatidylinositol 3-kinase regulatory subunit alpha
(Homo sapiens (Human))
BDBM315555
(US10172858, Table 2.52 | US9828378, # 52)
Show SMILES CN1CCN(CC1)C1CC(C1)n1nc(-c2cc3cc(O)ccc3[nH]2)c2c(N)ncnc12 |(3.02,-10.82,;2.62,-9.33,;1.06,-8.91,;.71,-7.39,;1.8,-6.3,;3.29,-6.7,;3.76,-8.19,;1.4,-4.81,;.07,-4.04,;.84,-2.71,;2.17,-3.48,;.44,-1.22,;1.35,.03,;.44,1.27,;.84,2.76,;-.06,4,;.84,5.25,;.52,6.76,;1.67,7.79,;1.27,9.27,;3.13,7.31,;3.45,5.8,;2.31,4.77,;2.31,3.23,;-1.02,.8,;-2.36,1.57,;-2.36,3.11,;-3.69,.8,;-3.69,-.74,;-2.36,-1.51,;-1.02,-.74,)|
Show InChI InChI=1S/C22H26N8O/c1-28-4-6-29(7-5-28)14-10-15(11-14)30-22-19(21(23)24-12-25-22)20(27-30)18-9-13-8-16(31)2-3-17(13)26-18/h2-3,8-9,12,14-15,26,31H,4-7,10-11H2,1H3,(H2,23,24,25)
US Patent
n/an/a>500n/an/an/an/an/an/a
INTELLIKINE LLC
US Patent
Assay Description
This assay is relatively simple, reasonably sensitive, and the peptide substrate can be adjusted both in terms of sequence and concentration to meet ...
US Patent US10172858 (2019)
BindingDB Entry DOI: 10.7270/Q2736T01
Phosphatidylinositol 3-kinase regulatory subunit beta
(Homo sapiens (Human))
BDBM315555
(US10172858, Table 2.52 | US9828378, # 52)
Show SMILES CN1CCN(CC1)C1CC(C1)n1nc(-c2cc3cc(O)ccc3[nH]2)c2c(N)ncnc12 |(3.02,-10.82,;2.62,-9.33,;1.06,-8.91,;.71,-7.39,;1.8,-6.3,;3.29,-6.7,;3.76,-8.19,;1.4,-4.81,;.07,-4.04,;.84,-2.71,;2.17,-3.48,;.44,-1.22,;1.35,.03,;.44,1.27,;.84,2.76,;-.06,4,;.84,5.25,;.52,6.76,;1.67,7.79,;1.27,9.27,;3.13,7.31,;3.45,5.8,;2.31,4.77,;2.31,3.23,;-1.02,.8,;-2.36,1.57,;-2.36,3.11,;-3.69,.8,;-3.69,-.74,;-2.36,-1.51,;-1.02,-.74,)|
Show InChI InChI=1S/C22H26N8O/c1-28-4-6-29(7-5-28)14-10-15(11-14)30-22-19(21(23)24-12-25-22)20(27-30)18-9-13-8-16(31)2-3-17(13)26-18/h2-3,8-9,12,14-15,26,31H,4-7,10-11H2,1H3,(H2,23,24,25)
NCI pathway
Reactome pathway
US Patent
n/an/a>500n/an/an/an/an/an/a
INTELLIKINE LLC
US Patent
Assay Description
This assay is relatively simple, reasonably sensitive, and the peptide substrate can be adjusted both in terms of sequence and concentration to meet ...
US Patent US10172858 (2019)
BindingDB Entry DOI: 10.7270/Q2736T01
Phosphatidylinositol 4,5-bisphosphate 3-kinase catalytic subunit gamma isoform
(Homo sapiens (Human))
BDBM315555
(US10172858, Table 2.52 | US9828378, # 52)
Show SMILES CN1CCN(CC1)C1CC(C1)n1nc(-c2cc3cc(O)ccc3[nH]2)c2c(N)ncnc12 |(3.02,-10.82,;2.62,-9.33,;1.06,-8.91,;.71,-7.39,;1.8,-6.3,;3.29,-6.7,;3.76,-8.19,;1.4,-4.81,;.07,-4.04,;.84,-2.71,;2.17,-3.48,;.44,-1.22,;1.35,.03,;.44,1.27,;.84,2.76,;-.06,4,;.84,5.25,;.52,6.76,;1.67,7.79,;1.27,9.27,;3.13,7.31,;3.45,5.8,;2.31,4.77,;2.31,3.23,;-1.02,.8,;-2.36,1.57,;-2.36,3.11,;-3.69,.8,;-3.69,-.74,;-2.36,-1.51,;-1.02,-.74,)|
Show InChI InChI=1S/C22H26N8O/c1-28-4-6-29(7-5-28)14-10-15(11-14)30-22-19(21(23)24-12-25-22)20(27-30)18-9-13-8-16(31)2-3-17(13)26-18/h2-3,8-9,12,14-15,26,31H,4-7,10-11H2,1H3,(H2,23,24,25)
NCI pathway
Reactome pathway
US Patent
n/an/a>500n/an/an/an/an/an/a
INTELLIKINE LLC
US Patent
Assay Description
This assay is relatively simple, reasonably sensitive, and the peptide substrate can be adjusted both in terms of sequence and concentration to meet ...
US Patent US10172858 (2019)
BindingDB Entry DOI: 10.7270/Q2736T01
Phosphatidylinositol 4,5-bisphosphate 3-kinase catalytic subunit delta isoform
(Homo sapiens (Human))
BDBM315555
(US10172858, Table 2.52 | US9828378, # 52)
Show SMILES CN1CCN(CC1)C1CC(C1)n1nc(-c2cc3cc(O)ccc3[nH]2)c2c(N)ncnc12 |(3.02,-10.82,;2.62,-9.33,;1.06,-8.91,;.71,-7.39,;1.8,-6.3,;3.29,-6.7,;3.76,-8.19,;1.4,-4.81,;.07,-4.04,;.84,-2.71,;2.17,-3.48,;.44,-1.22,;1.35,.03,;.44,1.27,;.84,2.76,;-.06,4,;.84,5.25,;.52,6.76,;1.67,7.79,;1.27,9.27,;3.13,7.31,;3.45,5.8,;2.31,4.77,;2.31,3.23,;-1.02,.8,;-2.36,1.57,;-2.36,3.11,;-3.69,.8,;-3.69,-.74,;-2.36,-1.51,;-1.02,-.74,)|
Show InChI InChI=1S/C22H26N8O/c1-28-4-6-29(7-5-28)14-10-15(11-14)30-22-19(21(23)24-12-25-22)20(27-30)18-9-13-8-16(31)2-3-17(13)26-18/h2-3,8-9,12,14-15,26,31H,4-7,10-11H2,1H3,(H2,23,24,25)
NCI pathway
Reactome pathway
US Patent
n/an/a<500n/an/an/an/an/an/a
Intellikine LLC
US Patent
Assay Description
Class I PI3-Ks can be either purchased (p110α/p85α, p110β/p85α, p110δ/p85α from Upstate, and p110γ from Sigma) or...
US Patent US9828378 (2017)
BindingDB Entry DOI: 10.7270/Q2542QWN
Cytosolic arginine sensor for mTORC1 subunit 1
(Homo sapiens (Human))
BDBM315555
(US10172858, Table 2.52 | US9828378, # 52)
Show SMILES CN1CCN(CC1)C1CC(C1)n1nc(-c2cc3cc(O)ccc3[nH]2)c2c(N)ncnc12 |(3.02,-10.82,;2.62,-9.33,;1.06,-8.91,;.71,-7.39,;1.8,-6.3,;3.29,-6.7,;3.76,-8.19,;1.4,-4.81,;.07,-4.04,;.84,-2.71,;2.17,-3.48,;.44,-1.22,;1.35,.03,;.44,1.27,;.84,2.76,;-.06,4,;.84,5.25,;.52,6.76,;1.67,7.79,;1.27,9.27,;3.13,7.31,;3.45,5.8,;2.31,4.77,;2.31,3.23,;-1.02,.8,;-2.36,1.57,;-2.36,3.11,;-3.69,.8,;-3.69,-.74,;-2.36,-1.51,;-1.02,-.74,)|
Show InChI InChI=1S/C22H26N8O/c1-28-4-6-29(7-5-28)14-10-15(11-14)30-22-19(21(23)24-12-25-22)20(27-30)18-9-13-8-16(31)2-3-17(13)26-18/h2-3,8-9,12,14-15,26,31H,4-7,10-11H2,1H3,(H2,23,24,25)
US Patent
n/an/a<500n/an/an/an/an/an/a
Intellikine LLC
US Patent
Assay Description
Class I PI3-Ks can be either purchased (p110α/p85α, p110β/p85α, p110δ/p85α from Upstate, and p110γ from Sigma) or...
US Patent US9828378 (2017)
BindingDB Entry DOI: 10.7270/Q2542QWN
Phosphatidylinositol 4,5-bisphosphate 3-kinase catalytic subunit alpha isoform
(Homo sapiens (Human))
BDBM315555
(US10172858, Table 2.52 | US9828378, # 52)
Show SMILES CN1CCN(CC1)C1CC(C1)n1nc(-c2cc3cc(O)ccc3[nH]2)c2c(N)ncnc12 |(3.02,-10.82,;2.62,-9.33,;1.06,-8.91,;.71,-7.39,;1.8,-6.3,;3.29,-6.7,;3.76,-8.19,;1.4,-4.81,;.07,-4.04,;.84,-2.71,;2.17,-3.48,;.44,-1.22,;1.35,.03,;.44,1.27,;.84,2.76,;-.06,4,;.84,5.25,;.52,6.76,;1.67,7.79,;1.27,9.27,;3.13,7.31,;3.45,5.8,;2.31,4.77,;2.31,3.23,;-1.02,.8,;-2.36,1.57,;-2.36,3.11,;-3.69,.8,;-3.69,-.74,;-2.36,-1.51,;-1.02,-.74,)|
Show InChI InChI=1S/C22H26N8O/c1-28-4-6-29(7-5-28)14-10-15(11-14)30-22-19(21(23)24-12-25-22)20(27-30)18-9-13-8-16(31)2-3-17(13)26-18/h2-3,8-9,12,14-15,26,31H,4-7,10-11H2,1H3,(H2,23,24,25)
NCI pathway
Reactome pathway
US Patent
n/an/a>500n/an/an/an/an/an/a
Intellikine LLC
US Patent
Assay Description
Class I PI3-Ks can be either purchased (p110α/p85α, p110β/p85α, p110δ/p85α from Upstate, and p110γ from Sigma) or...
US Patent US9828378 (2017)
BindingDB Entry DOI: 10.7270/Q2542QWN
Phosphatidylinositol 4-phosphate 3-kinase C2 domain-containing subunit beta
(Homo sapiens (Human))
BDBM315555
(US10172858, Table 2.52 | US9828378, # 52)
Show SMILES CN1CCN(CC1)C1CC(C1)n1nc(-c2cc3cc(O)ccc3[nH]2)c2c(N)ncnc12 |(3.02,-10.82,;2.62,-9.33,;1.06,-8.91,;.71,-7.39,;1.8,-6.3,;3.29,-6.7,;3.76,-8.19,;1.4,-4.81,;.07,-4.04,;.84,-2.71,;2.17,-3.48,;.44,-1.22,;1.35,.03,;.44,1.27,;.84,2.76,;-.06,4,;.84,5.25,;.52,6.76,;1.67,7.79,;1.27,9.27,;3.13,7.31,;3.45,5.8,;2.31,4.77,;2.31,3.23,;-1.02,.8,;-2.36,1.57,;-2.36,3.11,;-3.69,.8,;-3.69,-.74,;-2.36,-1.51,;-1.02,-.74,)|
Show InChI InChI=1S/C22H26N8O/c1-28-4-6-29(7-5-28)14-10-15(11-14)30-22-19(21(23)24-12-25-22)20(27-30)18-9-13-8-16(31)2-3-17(13)26-18/h2-3,8-9,12,14-15,26,31H,4-7,10-11H2,1H3,(H2,23,24,25)
NCI pathway
Reactome pathway
US Patent
n/an/a>500n/an/an/an/an/an/a
Intellikine LLC
US Patent
Assay Description
Class I PI3-Ks can be either purchased (p110α/p85α, p110β/p85α, p110δ/p85α from Upstate, and p110γ from Sigma) or...
US Patent US9828378 (2017)
BindingDB Entry DOI: 10.7270/Q2542QWN
Phosphatidylinositol 4,5-bisphosphate 3-kinase catalytic subunit gamma isoform
(Homo sapiens (Human))
BDBM315555
(US10172858, Table 2.52 | US9828378, # 52)
Show SMILES CN1CCN(CC1)C1CC(C1)n1nc(-c2cc3cc(O)ccc3[nH]2)c2c(N)ncnc12 |(3.02,-10.82,;2.62,-9.33,;1.06,-8.91,;.71,-7.39,;1.8,-6.3,;3.29,-6.7,;3.76,-8.19,;1.4,-4.81,;.07,-4.04,;.84,-2.71,;2.17,-3.48,;.44,-1.22,;1.35,.03,;.44,1.27,;.84,2.76,;-.06,4,;.84,5.25,;.52,6.76,;1.67,7.79,;1.27,9.27,;3.13,7.31,;3.45,5.8,;2.31,4.77,;2.31,3.23,;-1.02,.8,;-2.36,1.57,;-2.36,3.11,;-3.69,.8,;-3.69,-.74,;-2.36,-1.51,;-1.02,-.74,)|
Show InChI InChI=1S/C22H26N8O/c1-28-4-6-29(7-5-28)14-10-15(11-14)30-22-19(21(23)24-12-25-22)20(27-30)18-9-13-8-16(31)2-3-17(13)26-18/h2-3,8-9,12,14-15,26,31H,4-7,10-11H2,1H3,(H2,23,24,25)
NCI pathway
Reactome pathway
US Patent
n/an/a>500n/an/an/an/an/an/a
Intellikine LLC
US Patent
Assay Description
Class I PI3-Ks can be either purchased (p110α/p85α, p110β/p85α, p110δ/p85α from Upstate, and p110γ from Sigma) or...
US Patent US9828378 (2017)
BindingDB Entry DOI: 10.7270/Q2542QWN
Phosphatidylinositol 4,5-bisphosphate 3-kinase catalytic subunit delta isoform
(Homo sapiens (Human))
BDBM315555
(US10172858, Table 2.52 | US9828378, # 52)
Show SMILES CN1CCN(CC1)C1CC(C1)n1nc(-c2cc3cc(O)ccc3[nH]2)c2c(N)ncnc12 |(3.02,-10.82,;2.62,-9.33,;1.06,-8.91,;.71,-7.39,;1.8,-6.3,;3.29,-6.7,;3.76,-8.19,;1.4,-4.81,;.07,-4.04,;.84,-2.71,;2.17,-3.48,;.44,-1.22,;1.35,.03,;.44,1.27,;.84,2.76,;-.06,4,;.84,5.25,;.52,6.76,;1.67,7.79,;1.27,9.27,;3.13,7.31,;3.45,5.8,;2.31,4.77,;2.31,3.23,;-1.02,.8,;-2.36,1.57,;-2.36,3.11,;-3.69,.8,;-3.69,-.74,;-2.36,-1.51,;-1.02,-.74,)|
Show InChI InChI=1S/C22H26N8O/c1-28-4-6-29(7-5-28)14-10-15(11-14)30-22-19(21(23)24-12-25-22)20(27-30)18-9-13-8-16(31)2-3-17(13)26-18/h2-3,8-9,12,14-15,26,31H,4-7,10-11H2,1H3,(H2,23,24,25)
NCI pathway
Reactome pathway
US Patent
n/an/a<500n/an/an/an/an/an/a
INTELLIKINE LLC
US Patent
Assay Description
This assay is relatively simple, reasonably sensitive, and the peptide substrate can be adjusted both in terms of sequence and concentration to meet ...
US Patent US10172858 (2019)
BindingDB Entry DOI: 10.7270/Q2736T01