BDBM31584 oxadiazole derivative, 20u
SMILES: COc1ccc(cc1)-c1coc2ccc(cc12)-c1nnc(SCc2cccc(c2)C#N)o1
InChI Key: InChIKey=HEPWXBRJTLKQBU-UHFFFAOYSA-N
Data: 1 IC50
Activity Spreadsheet -- Enzyme Inhibition Constant Data from BindingDB
Found 1 hit for monomerid = 31584
Trg + Lig
Ki
nM
ΔG°
kcal/mole
IC50
nM
Kd
nM
EC50/IC50
nM
koff
s-1
kon
M-1s-1
pHTemp
°C
Glycogen synthase kinase-3 beta
(Homo sapiens (Human))
BDBM31584
(oxadiazole derivative, 20u)
Show SMILES COc1ccc(cc1)-c1coc2ccc(cc12)-c1nnc(SCc2cccc(c2)C#N)o1
Show InChI InChI=1S/C25H17N3O3S/c1-29-20-8-5-18(6-9-20)22-14-30-23-10-7-19(12-21(22)23)24-27-28-25(31-24)32-15-17-4-2-3-16(11-17)13-26/h2-12,14H,15H2,1H3
NCI pathway
Reactome pathway
n/an/a 3.5n/an/an/an/a7.537
Takeda Pharmaceutical Company Ltd.
Assay Description
Human GSK-3beta was expressed as the N-terminal FLAG-tagged protein using a baculovirus expression system. The kinase assay was was conducted in a 96...
Bioorg Med Chem 17: 2017-29 (2009)
Article DOI: 10.1016/j.bmc.2009.01.019
BindingDB Entry DOI: 10.7270/Q2DR2STZ