null
SMILES: Cn1cc(c(n1)-c1ccc(OCc2nc3ccccc3n2C)cc1)-c1ccncc1
InChI Key: InChIKey=FHQWSFMPRITQCW-UHFFFAOYSA-N
Activity Spreadsheet -- Enzyme Inhibition Constant Data from BindingDB
Found 1 hit for monomerid = 31605
Trg + Lig
Ki
nM
ΔG°
kcal/mole
IC50
nM
Kd
nM
EC50/IC50
nM
koff
s-1
kon
M-1s-1
pHTemp
°C
cAMP and cAMP-inhibited cGMP 3',5'-cyclic phosphodiesterase 10A
(Rattus norvegicus (rat))
BDBM31605
(methyl substituted pyrazole, 26)
Show SMILES Cn1cc(c(n1)-c1ccc(OCc2nc3ccccc3n2C)cc1)-c1ccncc1
Show InChI InChI=1S/C24H21N5O/c1-28-15-20(17-11-13-25-14-12-17)24(27-28)18-7-9-19(10-8-18)30-16-23-26-21-5-3-4-6-22(21)29(23)2/h3-15H,16H2,1-2H3
Reactome pathway
n/an/a 1.29n/an/an/an/a7.523
Pfizer
Assay Description
PDE activity was measured using a plate-based Scintillation Proximity Assay (SPA). For competitive enzyme inhibition assays, the substrate [3H]cAMP c...
J Med Chem 52: 5188-96 (2009)
Article DOI: 10.1021/jm900521k
BindingDB Entry DOI: 10.7270/Q290223B