BDBM316176 N-(2-methoxy-5-(6-(2-methoxyphenyl)pyrimidin-4-ylamino)benzyl)methanesulfonamide::US10294218, Example 4::US9617225, Example 4
SMILES: COc1ccc(Nc2cc(ncn2)-c2ccccc2OC)cc1CNS(C)(=O)=O
InChI Key: InChIKey=MGZRNXBSXMBQDH-UHFFFAOYSA-N
Data: 2 IC50
Activity Spreadsheet -- Enzyme Inhibition Constant Data from BindingDB
Found 2 hits for monomerid = 316176
Trg + Lig
Ki
nM
ΔG°
kcal/mole
IC50
nM
Kd
nM
EC50/IC50
nM
koff
s-1
kon
M-1s-1
pHTemp
°C
Cyclin-Dependent Kinase 9 (CDK9)
(Homo sapiens (Human))
BDBM316176
(N-(2-methoxy-5-(6-(2-methoxyphenyl)pyrimidin-4-yla...)
Show SMILES COc1ccc(Nc2cc(ncn2)-c2ccccc2OC)cc1CNS(C)(=O)=O
Show InChI InChI=1S/C20H22N4O4S/c1-27-18-9-8-15(10-14(18)12-23-29(3,25)26)24-20-11-17(21-13-22-20)16-6-4-5-7-19(16)28-2/h4-11,13,23H,12H2,1-3H3,(H,21,22,24)
Reactome pathway
US Patent
n/an/a<100n/an/an/an/an/an/a
GSK
Assay Description
The activity of the compounds described in the present invention can be determined by measuring the phosphorylation of a fluorescently-labeled peptid...
Bioorg Med Chem Lett 18: 1022-6 (2008)
BindingDB Entry DOI: 10.7270/Q2RB76X4
Cyclin-dependent kinase 9
(Homo sapiens (Human))
BDBM316176
(N-(2-methoxy-5-(6-(2-methoxyphenyl)pyrimidin-4-yla...)
Show SMILES COc1ccc(Nc2cc(ncn2)-c2ccccc2OC)cc1CNS(C)(=O)=O
Show InChI InChI=1S/C20H22N4O4S/c1-27-18-9-8-15(10-14(18)12-23-29(3,25)26)24-20-11-17(21-13-22-20)16-6-4-5-7-19(16)28-2/h4-11,13,23H,12H2,1-3H3,(H,21,22,24)
Reactome pathway
US Patent
n/an/a<100n/an/an/an/an/an/a
VIROSTATICS SRL
US Patent
Assay Description
The activity of the compounds described in the present invention can be determined by measuring the phosphorylation of a fluorescently-labeled peptid...
US Patent US9617225 (2017)
BindingDB Entry DOI: 10.7270/Q29W0HK6