BDBM316301 5-[6-(2-Ethoxy-phenyl)-pyrimidin-4- ylamino]-2-methoxy-benzamide::US10294218, Example 129::US9617225, Example 129
SMILES: CCOc1ccccc1-c1cc(Nc2ccc(OC)c(c2)C(N)=O)ncn1
InChI Key: InChIKey=JYPPBSTUNBNCQP-UHFFFAOYSA-N
Data: 2 IC50
Activity Spreadsheet -- Enzyme Inhibition Constant Data from BindingDB
Found 2 hits for monomerid = 316301
Trg + Lig
Ki
nM
ΔG°
kcal/mole
IC50
nM
Kd
nM
EC50/IC50
nM
koff
s-1
kon
M-1s-1
pHTemp
°C
Cyclin-Dependent Kinase 9 (CDK9)
(Homo sapiens (Human))
BDBM316301
(5-[6-(2-Ethoxy-phenyl)-pyrimidin-4- ylamino]-2-met...)
Show SMILES CCOc1ccccc1-c1cc(Nc2ccc(OC)c(c2)C(N)=O)ncn1
Show InChI InChI=1S/C20H20N4O3/c1-3-27-18-7-5-4-6-14(18)16-11-19(23-12-22-16)24-13-8-9-17(26-2)15(10-13)20(21)25/h4-12H,3H2,1-2H3,(H2,21,25)(H,22,23,24)
Reactome pathway
US Patent
n/an/a<100n/an/an/an/an/an/a
GSK
Assay Description
The activity of the compounds described in the present invention can be determined by measuring the phosphorylation of a fluorescently-labeled peptid...
Bioorg Med Chem Lett 18: 1022-6 (2008)
BindingDB Entry DOI: 10.7270/Q2RB76X4
Cyclin-dependent kinase 9
(Homo sapiens (Human))
BDBM316301
(5-[6-(2-Ethoxy-phenyl)-pyrimidin-4- ylamino]-2-met...)
Show SMILES CCOc1ccccc1-c1cc(Nc2ccc(OC)c(c2)C(N)=O)ncn1
Show InChI InChI=1S/C20H20N4O3/c1-3-27-18-7-5-4-6-14(18)16-11-19(23-12-22-16)24-13-8-9-17(26-2)15(10-13)20(21)25/h4-12H,3H2,1-2H3,(H2,21,25)(H,22,23,24)
Reactome pathway
US Patent
n/an/a<100n/an/an/an/an/an/a
VIROSTATICS SRL
US Patent
Assay Description
The activity of the compounds described in the present invention can be determined by measuring the phosphorylation of a fluorescently-labeled peptid...
US Patent US9617225 (2017)
BindingDB Entry DOI: 10.7270/Q29W0HK6