BDBM316367 US9617239, BRITE-355123
SMILES: Clc1cc(sc1Oc1cccc(c1)N1CCNCC1)S(=O)(=O)NCc1cccc(Cl)c1
InChI Key: InChIKey=APSTXZKGSXGFCF-UHFFFAOYSA-N
Data: 1 IC50
Activity Spreadsheet -- Enzyme Inhibition Constant Data from BindingDB
Found 1 hit for monomerid = 316367
Trg + Lig
Ki
nM
ΔG°
kcal/mole
IC50
nM
Kd
nM
EC50/IC50
nM
koff
s-1
kon
M-1s-1
pHTemp
°C
Beta-glucuronidase
(Homo sapiens (Human))
BDBM316367
(US9617239, BRITE-355123)
Show SMILES Clc1cc(sc1Oc1cccc(c1)N1CCNCC1)S(=O)(=O)NCc1cccc(Cl)c1
Show InChI InChI=1S/C21H21Cl2N3O3S2/c22-16-4-1-3-15(11-16)14-25-31(27,28)20-13-19(23)21(30-20)29-18-6-2-5-17(12-18)26-9-7-24-8-10-26/h1-6,11-13,24-25H,7-10,14H2
US Patent
n/an/a 90n/an/an/an/an/an/a
North Carolina Central University; The University of North Carolina at Chapel Hill
US Patent
Assay Description
The β-glucuronidase assay was performed by the addition of 0.5 μl of compound (or DMSO) to the well of a black 384-well plate followed by t...
US Patent US9617239 (2017)
BindingDB Entry DOI: 10.7270/Q22B913V