null
SMILES: Clc1ccc(CC[C@@]2(Cn3ccnc3)OC[C@@H](CSc3ccc(Br)cc3)O2)cc1
InChI Key: InChIKey=FIBVJAHFMJFMLB-RBBKRZOGSA-N
Activity Spreadsheet -- Enzyme Inhibition Constant Data from BindingDB
Found 4 hits for monomerid = 31658
Trg + Lig
Ki
nM
ΔG°
kcal/mole
IC50
nM
Kd
nM
EC50/IC50
nM
koff
s-1
kon
M-1s-1
pHTemp
°C
Heme oxygenase 1
(Rattus norvegicus (rat))
BDBM31658
(imidazole-dioxolane, 10)
Show SMILES Clc1ccc(CC[C@@]2(Cn3ccnc3)OC[C@@H](CSc3ccc(Br)cc3)O2)cc1 |r|
Show InChI InChI=1S/C22H22BrClN2O2S/c23-18-3-7-21(8-4-18)29-14-20-13-27-22(28-20,15-26-12-11-25-16-26)10-9-17-1-5-19(24)6-2-17/h1-8,11-12,16,20H,9-10,13-15H2/t20-,22+/m0/s1
Reactome pathway
n/an/a 2.10E+3n/an/an/an/a7.437
Queen's University
Assay Description
HO activity in rat spleen (HO-1) and brain (HO-2) microsomal fractions was determined by the quantitation of CO formed from the degradation of methem...
Bioorg Med Chem 17: 2461-75 (2009)
Article DOI: 10.1016/j.bmc.2009.01.078
BindingDB Entry DOI: 10.7270/Q2WQ0250
Cytochrome P450 3A1
(Rattus norvegicus (rat))
BDBM31658
(imidazole-dioxolane, 10)
Show SMILES Clc1ccc(CC[C@@]2(Cn3ccnc3)OC[C@@H](CSc3ccc(Br)cc3)O2)cc1 |r|
Show InChI InChI=1S/C22H22BrClN2O2S/c23-18-3-7-21(8-4-18)29-14-20-13-27-22(28-20,15-26-12-11-25-16-26)10-9-17-1-5-19(24)6-2-17/h1-8,11-12,16,20H,9-10,13-15H2/t20-,22+/m0/s1
n/an/a 2.10E+3n/an/an/an/an/an/a
Queen's University
Assay Description
CYP3A1/3A2-catalyzed erythromycin N-demethylase activity was determined by the spectrophotometric measurement of formaldehyde. Briefly, reaction mixt...
Bioorg Med Chem 17: 2461-75 (2009)
Article DOI: 10.1016/j.bmc.2009.01.078
BindingDB Entry DOI: 10.7270/Q2WQ0250
Heme oxygenase 2
(Rattus norvegicus (rat))
BDBM31658
(imidazole-dioxolane, 10)
Show SMILES Clc1ccc(CC[C@@]2(Cn3ccnc3)OC[C@@H](CSc3ccc(Br)cc3)O2)cc1 |r|
Show InChI InChI=1S/C22H22BrClN2O2S/c23-18-3-7-21(8-4-18)29-14-20-13-27-22(28-20,15-26-12-11-25-16-26)10-9-17-1-5-19(24)6-2-17/h1-8,11-12,16,20H,9-10,13-15H2/t20-,22+/m0/s1
Reactome pathway
n/an/a 2.40E+3n/an/an/an/a7.4n/a
Queen's University
Assay Description
HO activity in rat spleen (HO-1) and brain (HO-2) microsomal fractions was determined by the quantitation of CO formed from the degradation of methem...
Bioorg Med Chem 17: 2461-75 (2009)
Article DOI: 10.1016/j.bmc.2009.01.078
BindingDB Entry DOI: 10.7270/Q2WQ0250
Cytochrome P450 2E1
(Rattus norvegicus (rat))
BDBM31658
(imidazole-dioxolane, 10)
Show SMILES Clc1ccc(CC[C@@]2(Cn3ccnc3)OC[C@@H](CSc3ccc(Br)cc3)O2)cc1 |r|
Show InChI InChI=1S/C22H22BrClN2O2S/c23-18-3-7-21(8-4-18)29-14-20-13-27-22(28-20,15-26-12-11-25-16-26)10-9-17-1-5-19(24)6-2-17/h1-8,11-12,16,20H,9-10,13-15H2/t20-,22+/m0/s1
Reactome pathway
n/an/a>1.00E+5n/an/an/an/a7.437
Queen's University
Assay Description
CYP2E1 hydroxylation of p-nitrophenol was determined by the spectrophotometric measurement of 4-nitrocatechol. Briefly, reaction mixture consisting o...
Bioorg Med Chem 17: 2461-75 (2009)
Article DOI: 10.1016/j.bmc.2009.01.078
BindingDB Entry DOI: 10.7270/Q2WQ0250