BDBM316673 2-[(1-acryloylpiperidin-4-yl)amino]-N-(propan-2-yl)-5H-pyrrolo[2,3-b]pyrazine-7-carboxamide::US9617258, Example 168
SMILES: CC(C)NC(=O)c1c[nH]c2ncc(NC3CCN(CC3)C(=O)C=C)nc12
InChI Key: InChIKey=SFMZHDRDRFCQHK-UHFFFAOYSA-N
Data: 2 IC50
Activity Spreadsheet -- Enzyme Inhibition Constant Data from BindingDB
Found 4 hits for monomerid = 316673
Trg + Lig
Ki
nM
ΔG°
kcal/mole
IC50
nM
Kd
nM
EC50/IC50
nM
koff
s-1
kon
M-1s-1
pHTemp
°C
Tyrosine-protein kinase JAK3
(Homo sapiens (Human))
BDBM316673
(2-[(1-acryloylpiperidin-4-yl)amino]-N-(propan-2-yl...)
Show SMILES CC(C)NC(=O)c1c[nH]c2ncc(NC3CCN(CC3)C(=O)C=C)nc12
Show InChI InChI=1S/C18H24N6O2/c1-4-15(25)24-7-5-12(6-8-24)22-14-10-20-17-16(23-14)13(9-19-17)18(26)21-11(2)3/h4,9-12H,1,5-8H2,2-3H3,(H,19,20)(H,21,26)(H,22,23)
Reactome pathway
US Patent
n/an/a 0.200n/an/an/an/an/an/a
Pfizer Inc.
US Patent
Assay Description
Test article was solubilized in dimethyl sulfoxide (DMSO) to a stock concentration of 30 mM. An 11-point half log dilution series was created in DMSO...
US Patent US9617258 (2017)
BindingDB Entry DOI: 10.7270/Q2JD4ZWG
Tyrosine-protein kinase JAK3
(Homo sapiens (Human))
BDBM316673
(2-[(1-acryloylpiperidin-4-yl)amino]-N-(propan-2-yl...)
Show SMILES CC(C)NC(=O)c1c[nH]c2ncc(NC3CCN(CC3)C(=O)C=C)nc12
Show InChI InChI=1S/C18H24N6O2/c1-4-15(25)24-7-5-12(6-8-24)22-14-10-20-17-16(23-14)13(9-19-17)18(26)21-11(2)3/h4,9-12H,1,5-8H2,2-3H3,(H,19,20)(H,21,26)(H,22,23)
Reactome pathway
n/an/a 7.5n/an/an/an/an/an/a
TBA
Citation and Details
Tyrosine-protein kinase JAK3
(Homo sapiens (Human))
BDBM316673
(2-[(1-acryloylpiperidin-4-yl)amino]-N-(propan-2-yl...)
Show SMILES CC(C)NC(=O)c1c[nH]c2ncc(NC3CCN(CC3)C(=O)C=C)nc12
Show InChI InChI=1S/C18H24N6O2/c1-4-15(25)24-7-5-12(6-8-24)22-14-10-20-17-16(23-14)13(9-19-17)18(26)21-11(2)3/h4,9-12H,1,5-8H2,2-3H3,(H,19,20)(H,21,26)(H,22,23)
Reactome pathway
n/an/a 0.200n/an/an/an/an/an/a
TBA
Citation and Details
Tyrosine-protein kinase JAK3
(Homo sapiens (Human))
BDBM316673
(2-[(1-acryloylpiperidin-4-yl)amino]-N-(propan-2-yl...)
Show SMILES CC(C)NC(=O)c1c[nH]c2ncc(NC3CCN(CC3)C(=O)C=C)nc12
Show InChI InChI=1S/C18H24N6O2/c1-4-15(25)24-7-5-12(6-8-24)22-14-10-20-17-16(23-14)13(9-19-17)18(26)21-11(2)3/h4,9-12H,1,5-8H2,2-3H3,(H,19,20)(H,21,26)(H,22,23)
Reactome pathway
US Patent
n/an/a 7.5n/an/an/an/an/an/a
Pfizer Inc.
US Patent
Assay Description
Test article was solubilized in dimethyl sulfoxide (DMSO) to a stock concentration of 30 mM. An 11-point half log dilution series was created in DMSO...
US Patent US9617258 (2017)
BindingDB Entry DOI: 10.7270/Q2JD4ZWG