BDBM316741 2-[(1-acryloylpiperidin-4-yl)amino]-N-[(3,3-difluorocyclobutyl)methyl]-5H-pyrrolo[2,3-b]pyrazine-7-carboxamide::US9617258, Example 238
SMILES: FC1(F)CC(CNC(=O)c2c[nH]c3ncc(NC4CCN(CC4)C(=O)C=C)nc23)C1
InChI Key: InChIKey=BDINRWLSSVFBCJ-UHFFFAOYSA-N
Data: 2 IC50
Activity Spreadsheet -- Enzyme Inhibition Constant Data from BindingDB
Found 4 hits for monomerid = 316741
Trg + Lig
Ki
nM
ΔG°
kcal/mole
IC50
nM
Kd
nM
EC50/IC50
nM
koff
s-1
kon
M-1s-1
pHTemp
°C
Tyrosine-protein kinase JAK3
(Homo sapiens (Human))
BDBM316741
(2-[(1-acryloylpiperidin-4-yl)amino]-N-[(3,3-difluo...)
Show SMILES FC1(F)CC(CNC(=O)c2c[nH]c3ncc(NC4CCN(CC4)C(=O)C=C)nc23)C1
Show InChI InChI=1S/C20H24F2N6O2/c1-2-16(29)28-5-3-13(4-6-28)26-15-11-24-18-17(27-15)14(10-23-18)19(30)25-9-12-7-20(21,22)8-12/h2,10-13H,1,3-9H2,(H,23,24)(H,25,30)(H,26,27)
Reactome pathway
US Patent
n/an/a 0.200n/an/an/an/an/an/a
Pfizer Inc.
US Patent
Assay Description
Test article was solubilized in dimethyl sulfoxide (DMSO) to a stock concentration of 30 mM. An 11-point half log dilution series was created in DMSO...
US Patent US9617258 (2017)
BindingDB Entry DOI: 10.7270/Q2JD4ZWG
Tyrosine-protein kinase JAK3
(Homo sapiens (Human))
BDBM316741
(2-[(1-acryloylpiperidin-4-yl)amino]-N-[(3,3-difluo...)
Show SMILES FC1(F)CC(CNC(=O)c2c[nH]c3ncc(NC4CCN(CC4)C(=O)C=C)nc23)C1
Show InChI InChI=1S/C20H24F2N6O2/c1-2-16(29)28-5-3-13(4-6-28)26-15-11-24-18-17(27-15)14(10-23-18)19(30)25-9-12-7-20(21,22)8-12/h2,10-13H,1,3-9H2,(H,23,24)(H,25,30)(H,26,27)
Reactome pathway
n/an/a 9.30n/an/an/an/an/an/a
TBA
Citation and Details
Tyrosine-protein kinase JAK3
(Homo sapiens (Human))
BDBM316741
(2-[(1-acryloylpiperidin-4-yl)amino]-N-[(3,3-difluo...)
Show SMILES FC1(F)CC(CNC(=O)c2c[nH]c3ncc(NC4CCN(CC4)C(=O)C=C)nc23)C1
Show InChI InChI=1S/C20H24F2N6O2/c1-2-16(29)28-5-3-13(4-6-28)26-15-11-24-18-17(27-15)14(10-23-18)19(30)25-9-12-7-20(21,22)8-12/h2,10-13H,1,3-9H2,(H,23,24)(H,25,30)(H,26,27)
Reactome pathway
n/an/a 0.200n/an/an/an/an/an/a
TBA
Citation and Details
Tyrosine-protein kinase JAK3
(Homo sapiens (Human))
BDBM316741
(2-[(1-acryloylpiperidin-4-yl)amino]-N-[(3,3-difluo...)
Show SMILES FC1(F)CC(CNC(=O)c2c[nH]c3ncc(NC4CCN(CC4)C(=O)C=C)nc23)C1
Show InChI InChI=1S/C20H24F2N6O2/c1-2-16(29)28-5-3-13(4-6-28)26-15-11-24-18-17(27-15)14(10-23-18)19(30)25-9-12-7-20(21,22)8-12/h2,10-13H,1,3-9H2,(H,23,24)(H,25,30)(H,26,27)
Reactome pathway
US Patent
n/an/a 9.30n/an/an/an/an/an/a
Pfizer Inc.
US Patent
Assay Description
Test article was solubilized in dimethyl sulfoxide (DMSO) to a stock concentration of 30 mM. An 11-point half log dilution series was created in DMSO...
US Patent US9617258 (2017)
BindingDB Entry DOI: 10.7270/Q2JD4ZWG