BDBM316754 2-[(1-acryloylpiperidin-4-yl)amino]-N-[(1R,2S)-2-fluorocyclopentyl]-5H-pyrrolo[2,3-b]pyrazine-7-carboxamide::US9617258, Example 251
SMILES: F[C@H]1CCC[C@H]1NC(=O)c1c[nH]c2ncc(NC3CCN(CC3)C(=O)C=C)nc12
InChI Key:
Data: 2 IC50
Activity Spreadsheet -- Enzyme Inhibition Constant Data from BindingDB
Found 4 hits for monomerid = 316754
Trg + Lig
Ki
nM
ΔG°
kcal/mole
IC50
nM
Kd
nM
EC50/IC50
nM
koff
s-1
kon
M-1s-1
pHTemp
°C
Tyrosine-protein kinase JAK3
(Homo sapiens (Human))
BDBM316754
(2-[(1-acryloylpiperidin-4-yl)amino]-N-[(1R,2S)-2-f...)
Show SMILES F[C@H]1CCC[C@H]1NC(=O)c1c[nH]c2ncc(NC3CCN(CC3)C(=O)C=C)nc12 |r|
Reactome pathway
US Patent
n/an/a 0.200n/an/an/an/an/an/a
Pfizer Inc.
US Patent
Assay Description
Test article was solubilized in dimethyl sulfoxide (DMSO) to a stock concentration of 30 mM. An 11-point half log dilution series was created in DMSO...
US Patent US9617258 (2017)
BindingDB Entry DOI: 10.7270/Q2JD4ZWG
Tyrosine-protein kinase JAK3
(Homo sapiens (Human))
BDBM316754
(2-[(1-acryloylpiperidin-4-yl)amino]-N-[(1R,2S)-2-f...)
Show SMILES F[C@H]1CCC[C@H]1NC(=O)c1c[nH]c2ncc(NC3CCN(CC3)C(=O)C=C)nc12 |r|
Reactome pathway
n/an/a 8.10n/an/an/an/an/an/a
TBA
Citation and Details
Tyrosine-protein kinase JAK3
(Homo sapiens (Human))
BDBM316754
(2-[(1-acryloylpiperidin-4-yl)amino]-N-[(1R,2S)-2-f...)
Show SMILES F[C@H]1CCC[C@H]1NC(=O)c1c[nH]c2ncc(NC3CCN(CC3)C(=O)C=C)nc12 |r|
Reactome pathway
n/an/a 0.200n/an/an/an/an/an/a
TBA
Citation and Details
Tyrosine-protein kinase JAK3
(Homo sapiens (Human))
BDBM316754
(2-[(1-acryloylpiperidin-4-yl)amino]-N-[(1R,2S)-2-f...)
Show SMILES F[C@H]1CCC[C@H]1NC(=O)c1c[nH]c2ncc(NC3CCN(CC3)C(=O)C=C)nc12 |r|
Reactome pathway
US Patent
n/an/a 8.10n/an/an/an/an/an/a
Pfizer Inc.
US Patent
Assay Description
Test article was solubilized in dimethyl sulfoxide (DMSO) to a stock concentration of 30 mM. An 11-point half log dilution series was created in DMSO...
US Patent US9617258 (2017)
BindingDB Entry DOI: 10.7270/Q2JD4ZWG