BDBM3171 3-(1-methyl-1H-indol-3-yl)-4-{1-[3-(methylamino)propyl]-1H-indol-3-yl}-2,5-dihydro-1H-pyrrole-2,5-dione::3-[1-[3-(Methylamino)propyl]-3-indolyl]-4-(1-methyl-3-indolyl)-1H-pyrrole-2,5-dione Hydrochloride::Bisindolylmaleimide 7::ROCHE screening, 51
SMILES: CNCCCn1cc(C2=C(C(=O)NC2=O)c2cn(C)c3ccccc23)c2ccccc12
InChI Key: InChIKey=AOUNSDICPNJTQM-UHFFFAOYSA-N
Data: 3 IC50
PDB links: 10 PDB IDs contain inhibitors having a similarity of 90% to this monomer.
Activity Spreadsheet -- Enzyme Inhibition Constant Data from BindingDB
Found 3 hits for monomerid = 3171
Trg + Lig
Ki
nM
ΔG°
kcal/mole
IC50
nM
Kd
nM
EC50/IC50
nM
koff
s-1
kon
M-1s-1
pHTemp
°C
Protein Kinase C
(Rattus norvegicus (rat))
BDBM3171
(3-(1-methyl-1H-indol-3-yl)-4-{1-[3-(methylamino)pr...)
Show SMILES CNCCCn1cc(C2=C(C(=O)NC2=O)c2cn(C)c3ccccc23)c2ccccc12 |t:8|
Show InChI InChI=1S/C25H24N4O2/c1-26-12-7-13-29-15-19(17-9-4-6-11-21(17)29)23-22(24(30)27-25(23)31)18-14-28(2)20-10-5-3-8-16(18)20/h3-6,8-11,14-15,26H,7,12-13H2,1-2H3,(H,27,30,31)
n/an/a 35n/an/an/an/a7.530
Roche Products Limited
Assay Description
The activity of PKC, activated by phosphatidylerine and Ca2+, is measured by its ability to transfer phosphate from [gamma-32P]ATP to lysine-rich his...
J Med Chem 35: 994-1001 (1992)
Article DOI: 10.1021/jm00084a004
BindingDB Entry DOI: 10.7270/Q2M043KK
Protein cereblon/Serine/threonine-protein kinase TBK1
(Homo sapiens (Human))
BDBM3171
(3-(1-methyl-1H-indol-3-yl)-4-{1-[3-(methylamino)pr...)
Show SMILES CNCCCn1cc(C2=C(C(=O)NC2=O)c2cn(C)c3ccccc23)c2ccccc12 |t:8|
Show InChI InChI=1S/C25H24N4O2/c1-26-12-7-13-29-15-19(17-9-4-6-11-21(17)29)23-22(24(30)27-25(23)31)18-14-28(2)20-10-5-3-8-16(18)20/h3-6,8-11,14-15,26H,7,12-13H2,1-2H3,(H,27,30,31)
n/an/a 1.96E+3n/an/an/an/an/an/a
Technical University of Dortmund
Assay Description
IC50 determinations for TBK1 were performed with the KinEASE-STK assay from Cisbio according to the manufacturer's instructions. A biotinylated s...
ACS Chem Biol 10: 289-98 (2015)
Article DOI: 10.1021/cb500908d
BindingDB Entry DOI: 10.7270/Q2WH2NRB
cAMP-Dependent Protein Kinase (PKA)
(Bos taurus (bovine))
BDBM3171
(3-(1-methyl-1H-indol-3-yl)-4-{1-[3-(methylamino)pr...)
Show SMILES CNCCCn1cc(C2=C(C(=O)NC2=O)c2cn(C)c3ccccc23)c2ccccc12 |t:8|
Show InChI InChI=1S/C25H24N4O2/c1-26-12-7-13-29-15-19(17-9-4-6-11-21(17)29)23-22(24(30)27-25(23)31)18-14-28(2)20-10-5-3-8-16(18)20/h3-6,8-11,14-15,26H,7,12-13H2,1-2H3,(H,27,30,31)
n/an/a 1.19E+4n/an/an/an/a8.537
Roche Products Limited
Assay Description
The activity of PKA, activated by cAMP, is measured by its ability to transfer phosphate from [gamma-32P]ATP to histone.
J Med Chem 35: 994-1001 (1992)
Article DOI: 10.1021/jm00084a004
BindingDB Entry DOI: 10.7270/Q2M043KK