BDBM31777 thieno[2,3-d]pyrimidine deriv., 2
SMILES: CCc1sc2nc(N)[nH]c(=O)c2c1Sc1ccc(cc1)C(=O)N[C@@H](CCC(O)=O)C(O)=O
InChI Key: InChIKey=RSFXTHIRRXEJJD-NSHDSACASA-N
Data: 6 IC50
PDB links: 2 PDB IDs match this monomer.
Activity Spreadsheet -- Enzyme Inhibition Constant Data from BindingDB
Found 6 hits for monomerid = 31777
Trg + Lig
Ki
nM
ΔG°
kcal/mole
IC50
nM
Kd
nM
EC50/IC50
nM
koff
s-1
kon
M-1s-1
pHTemp
°C
Thymidylate synthase
(Homo sapiens (Human))
BDBM31777
(thieno[2,3-d]pyrimidine deriv., 2)
Show SMILES CCc1sc2nc(N)[nH]c(=O)c2c1Sc1ccc(cc1)C(=O)N[C@@H](CCC(O)=O)C(O)=O |r|
Show InChI InChI=1S/C20H20N4O6S2/c1-2-12-15(14-17(28)23-20(21)24-18(14)32-12)31-10-5-3-9(4-6-10)16(27)22-11(19(29)30)7-8-13(25)26/h3-6,11H,2,7-8H2,1H3,(H,22,27)(H,25,26)(H,29,30)(H3,21,23,24,28)/t11-/m0/s1
NCI pathway
Reactome pathway
n/an/a 54n/an/an/an/a7.430
Duquesne University
Assay Description
TS was assayed spectrophotometrically in the reaction buffer solution containing (6R, 6S)-5, 10-CH2H4folate. The reaction was initiated by the additi...
J Med Chem 52: 4892-902 (2009)
Article DOI: 10.1021/jm900490a
BindingDB Entry DOI: 10.7270/Q2CR5RPK
Thymidylate Synthase (TS)
(Escherichia coli)
BDBM31777
(thieno[2,3-d]pyrimidine deriv., 2)
Show SMILES CCc1sc2nc(N)[nH]c(=O)c2c1Sc1ccc(cc1)C(=O)N[C@@H](CCC(O)=O)C(O)=O |r|
Show InChI InChI=1S/C20H20N4O6S2/c1-2-12-15(14-17(28)23-20(21)24-18(14)32-12)31-10-5-3-9(4-6-10)16(27)22-11(19(29)30)7-8-13(25)26/h3-6,11H,2,7-8H2,1H3,(H,22,27)(H,25,26)(H,29,30)(H3,21,23,24,28)/t11-/m0/s1
n/an/a 18n/an/an/an/a7.430
Duquesne University
Assay Description
TS was assayed spectrophotometrically in the reaction buffer solution containing (6R, 6S)-5, 10-CH2H4folate. The reaction was initiated by the additi...
J Med Chem 52: 4892-902 (2009)
Article DOI: 10.1021/jm900490a
BindingDB Entry DOI: 10.7270/Q2CR5RPK
Dihydrofolate reductase (DHFR)
(Toxoplasma gondii)
BDBM31777
(thieno[2,3-d]pyrimidine deriv., 2)
Show SMILES CCc1sc2nc(N)[nH]c(=O)c2c1Sc1ccc(cc1)C(=O)N[C@@H](CCC(O)=O)C(O)=O |r|
Show InChI InChI=1S/C20H20N4O6S2/c1-2-12-15(14-17(28)23-20(21)24-18(14)32-12)31-10-5-3-9(4-6-10)16(27)22-11(19(29)30)7-8-13(25)26/h3-6,11H,2,7-8H2,1H3,(H,22,27)(H,25,26)(H,29,30)(H3,21,23,24,28)/t11-/m0/s1
n/an/a 2.10n/an/an/an/an/an/a
Duquesne University
Assay Description
DHFRs were assayed spectrophotometrically in the reaction buffer solution containing dihydrofolate. The reaction was initiated with an amount of enzy...
J Med Chem 52: 4892-902 (2009)
Article DOI: 10.1021/jm900490a
BindingDB Entry DOI: 10.7270/Q2CR5RPK
Dihydrofolate reductase
(Homo sapiens (Human))
BDBM31777
(thieno[2,3-d]pyrimidine deriv., 2)
Show SMILES CCc1sc2nc(N)[nH]c(=O)c2c1Sc1ccc(cc1)C(=O)N[C@@H](CCC(O)=O)C(O)=O |r|
Show InChI InChI=1S/C20H20N4O6S2/c1-2-12-15(14-17(28)23-20(21)24-18(14)32-12)31-10-5-3-9(4-6-10)16(27)22-11(19(29)30)7-8-13(25)26/h3-6,11H,2,7-8H2,1H3,(H,22,27)(H,25,26)(H,29,30)(H3,21,23,24,28)/t11-/m0/s1
NCI pathway
Reactome pathway
n/an/a 19n/an/an/an/an/an/a
Duquesne University
Assay Description
DHFRs were assayed spectrophotometrically in the reaction buffer solution containing dihydrofolate. The reaction was initiated with an amount of enzy...
J Med Chem 52: 4892-902 (2009)
Article DOI: 10.1021/jm900490a
BindingDB Entry DOI: 10.7270/Q2CR5RPK
3D
3D Structure (crystal)
Dihydrofolate Reductase (DHFR)
(Escherichia coli)
BDBM31777
(thieno[2,3-d]pyrimidine deriv., 2)
Show SMILES CCc1sc2nc(N)[nH]c(=O)c2c1Sc1ccc(cc1)C(=O)N[C@@H](CCC(O)=O)C(O)=O |r|
Show InChI InChI=1S/C20H20N4O6S2/c1-2-12-15(14-17(28)23-20(21)24-18(14)32-12)31-10-5-3-9(4-6-10)16(27)22-11(19(29)30)7-8-13(25)26/h3-6,11H,2,7-8H2,1H3,(H,22,27)(H,25,26)(H,29,30)(H3,21,23,24,28)/t11-/m0/s1
n/an/a 1.00E+3n/an/an/an/an/an/a
Duquesne University
Assay Description
DHFRs were assayed spectrophotometrically in the reaction buffer solution containing dihydrofolate. The reaction was initiated with an amount of enzy...
J Med Chem 52: 4892-902 (2009)
Article DOI: 10.1021/jm900490a
BindingDB Entry DOI: 10.7270/Q2CR5RPK
Dihydrofolate reductase (DHFR)
(Toxoplasma gondii)
BDBM31777
(thieno[2,3-d]pyrimidine deriv., 2)
Show SMILES CCc1sc2nc(N)[nH]c(=O)c2c1Sc1ccc(cc1)C(=O)N[C@@H](CCC(O)=O)C(O)=O |r|
Show InChI InChI=1S/C20H20N4O6S2/c1-2-12-15(14-17(28)23-20(21)24-18(14)32-12)31-10-5-3-9(4-6-10)16(27)22-11(19(29)30)7-8-13(25)26/h3-6,11H,2,7-8H2,1H3,(H,22,27)(H,25,26)(H,29,30)(H3,21,23,24,28)/t11-/m0/s1
n/an/a 90n/an/an/an/an/an/a
Duquesne University
Assay Description
TS was assayed spectrophotometrically in the reaction buffer solution containing (6R, 6S)-5, 10-CH2H4folate. The reaction was initiated by the additi...
J Med Chem 52: 4892-902 (2009)
Article DOI: 10.1021/jm900490a
BindingDB Entry DOI: 10.7270/Q2CR5RPK