BDBM317852 US10399976, Compound 5::US10807980, Compound 5::US9624217, Compound 5
SMILES: CCS(=O)(=O)c1ccc(CNC(=O)c2cnc3[C@H](C(C)C)N(Cc4ccc(OC(F)F)cc4)Cc3c2)cc1
InChI Key: InChIKey=KWZXYIATROTWHB-SANMLTNESA-N
Data: 3 KI  2 IC50
Activity Spreadsheet -- Enzyme Inhibition Constant Data from BindingDB
Found 5 hits for monomerid = 317852
Trg + Lig
Ki
nM
ΔG°
kcal/mole
IC50
nM
Kd
nM
EC50/IC50
nM
koff
s-1
kon
M-1s-1
pHTemp
°C
Nuclear receptor ROR-gamma
(Homo sapiens (Human))
BDBM317852
(US10399976, Compound 5 | US10807980, Compound 5 | ...)
Show SMILES CCS(=O)(=O)c1ccc(CNC(=O)c2cnc3[C@H](C(C)C)N(Cc4ccc(OC(F)F)cc4)Cc3c2)cc1 |r|
Show InChI InChI=1S/C28H31F2N3O4S/c1-4-38(35,36)24-11-7-19(8-12-24)14-32-27(34)21-13-22-17-33(26(18(2)3)25(22)31-15-21)16-20-5-9-23(10-6-20)37-28(29)30/h5-13,15,18,26,28H,4,14,16-17H2,1-3H3,(H,32,34)/t26-/m0/s1
US Patent
<100n/an/an/an/an/an/an/an/a
Vitae Pharmaceuticals, LLC
US Patent
Assay Description
Compounds of the present invention were tested for ability to bind to RORγ in a cell-free competition assay with commercially available radio-li...
US Patent US10807980 (2020)
Nuclear receptor ROR-gamma
(Homo sapiens (Human))
BDBM317852
(US10399976, Compound 5 | US10807980, Compound 5 | ...)
Show SMILES CCS(=O)(=O)c1ccc(CNC(=O)c2cnc3[C@H](C(C)C)N(Cc4ccc(OC(F)F)cc4)Cc3c2)cc1 |r|
Show InChI InChI=1S/C28H31F2N3O4S/c1-4-38(35,36)24-11-7-19(8-12-24)14-32-27(34)21-13-22-17-33(26(18(2)3)25(22)31-15-21)16-20-5-9-23(10-6-20)37-28(29)30/h5-13,15,18,26,28H,4,14,16-17H2,1-3H3,(H,32,34)/t26-/m0/s1
US Patent
<100n/an/an/an/an/an/an/an/a
Vitae Pharmaceuticals, LLC
US Patent
Assay Description
Compounds of the present invention were tested for ability to bind to ROR gamma in a cell-free competition assay with commercially available radio-li...
US Patent US10399976 (2019)
BindingDB Entry DOI: 10.7270/Q2F76FXT
Nuclear receptor ROR-gamma
(Homo sapiens (Human))
BDBM317852
(US10399976, Compound 5 | US10807980, Compound 5 | ...)
Show SMILES CCS(=O)(=O)c1ccc(CNC(=O)c2cnc3[C@H](C(C)C)N(Cc4ccc(OC(F)F)cc4)Cc3c2)cc1 |r|
Show InChI InChI=1S/C28H31F2N3O4S/c1-4-38(35,36)24-11-7-19(8-12-24)14-32-27(34)21-13-22-17-33(26(18(2)3)25(22)31-15-21)16-20-5-9-23(10-6-20)37-28(29)30/h5-13,15,18,26,28H,4,14,16-17H2,1-3H3,(H,32,34)/t26-/m0/s1
US Patent
<100n/an/an/an/an/an/an/an/a
Vitae Pharmaceuticals, Inc.
US Patent
Assay Description
Compounds of the present invention were tested for ability to bind to RORγ in a cell-free competition assay with commercially available radio-li...
US Patent US9624217 (2017)
BindingDB Entry DOI: 10.7270/Q29P33RJ
Nuclear receptor ROR-gamma
(Homo sapiens (Human))
BDBM317852
(US10399976, Compound 5 | US10807980, Compound 5 | ...)
Show SMILES CCS(=O)(=O)c1ccc(CNC(=O)c2cnc3[C@H](C(C)C)N(Cc4ccc(OC(F)F)cc4)Cc3c2)cc1 |r|
Show InChI InChI=1S/C28H31F2N3O4S/c1-4-38(35,36)24-11-7-19(8-12-24)14-32-27(34)21-13-22-17-33(26(18(2)3)25(22)31-15-21)16-20-5-9-23(10-6-20)37-28(29)30/h5-13,15,18,26,28H,4,14,16-17H2,1-3H3,(H,32,34)/t26-/m0/s1
US Patent
n/an/a<100n/an/an/an/an/an/a
Vitae Pharmaceuticals, LLC
US Patent
Assay Description
Compounds of the present invention were tested for RORγ inverse agonist activity in a cell-based, transcriptional activity assay. Secreted Nanol...
US Patent US10807980 (2020)
Nuclear receptor ROR-gamma
(Homo sapiens (Human))
BDBM317852
(US10399976, Compound 5 | US10807980, Compound 5 | ...)
Show SMILES CCS(=O)(=O)c1ccc(CNC(=O)c2cnc3[C@H](C(C)C)N(Cc4ccc(OC(F)F)cc4)Cc3c2)cc1 |r|
Show InChI InChI=1S/C28H31F2N3O4S/c1-4-38(35,36)24-11-7-19(8-12-24)14-32-27(34)21-13-22-17-33(26(18(2)3)25(22)31-15-21)16-20-5-9-23(10-6-20)37-28(29)30/h5-13,15,18,26,28H,4,14,16-17H2,1-3H3,(H,32,34)/t26-/m0/s1
US Patent
n/an/a<100n/an/an/an/an/an/a
Vitae Pharmaceuticals, LLC
US Patent
Assay Description
Compounds of the present invention were tested for ROR gamma inverse agonist activity in a cell-based, transcriptional activity assay. Secreted Nanol...
US Patent US10399976 (2019)
BindingDB Entry DOI: 10.7270/Q2F76FXT