BDBM31853 2,4-Bisanilinopyrimidine, 18
SMILES: Oc1ccc(Nc2ncc(F)c(Nc3ccc(O)cc3)n2)cc1
InChI Key: InChIKey=VRCCTIYIKPFOBO-UHFFFAOYSA-N
Data: 1 IC50  1 EC50
Activity Spreadsheet -- Enzyme Inhibition Constant Data from BindingDB
Found 2 hits for monomerid = 31853
Trg + Lig
Ki
nM
ΔG°
kcal/mole
IC50
nM
Kd
nM
EC50/IC50
nM
koff
s-1
kon
M-1s-1
pHTemp
°C
Tyrosine-protein kinase SYK
(Homo sapiens (Human))
BDBM31853
(2,4-Bisanilinopyrimidine, 18)
Show SMILES Oc1ccc(Nc2ncc(F)c(Nc3ccc(O)cc3)n2)cc1
Show InChI InChI=1S/C16H13FN4O2/c17-14-9-18-16(20-11-3-7-13(23)8-4-11)21-15(14)19-10-1-5-12(22)6-2-10/h1-9,22-23H,(H2,18,19,20,21)
NCI pathway
Reactome pathway
n/an/an/an/a 3.40E+3n/an/an/an/a
Amarit Bioscience, Inc.
Curated by ChEMBL
Assay Description
Inhibition of SYK in human mast cell cultures assessed as reduction in IgE-induced FCepsilonR1 mediated degranulation by tryptase release assay
Bioorg Med Chem Lett 25: 2117-21 (2015)
Article DOI: 10.1016/j.bmcl.2015.03.075
BindingDB Entry DOI: 10.7270/Q2R49SFK
Aurora kinase A
(Homo sapiens (Human))
BDBM31853
(2,4-Bisanilinopyrimidine, 18)
Show SMILES Oc1ccc(Nc2ncc(F)c(Nc3ccc(O)cc3)n2)cc1
Show InChI InChI=1S/C16H13FN4O2/c17-14-9-18-16(20-11-3-7-13(23)8-4-11)21-15(14)19-10-1-5-12(22)6-2-10/h1-9,22-23H,(H2,18,19,20,21)
NCI pathway
Reactome pathway
n/an/a 30n/an/an/an/an/an/a
Genentech
Assay Description
Aurora kinase was assayed in ELISA format using a GST fusion of the N-terminus of Histone H3 as substrate. Plates were coated with substrate, and the...
J Med Chem 52: 3300-7 (2009)
Article DOI: 10.1021/jm9000314
BindingDB Entry DOI: 10.7270/Q2M90706