BDBM31858 2,4-Bisanilinopyrimidine, 23
SMILES: Oc1ccc(Nc2ncc(Cl)c(Nc3ccc(O)cc3)n2)cc1
InChI Key: InChIKey=FEPCQUSZQBCNQK-UHFFFAOYSA-N
Data: 1 IC50
Activity Spreadsheet -- Enzyme Inhibition Constant Data from BindingDB
Found 1 hit for monomerid = 31858
Trg + Lig
Ki
nM
ΔG°
kcal/mole
IC50
nM
Kd
nM
EC50/IC50
nM
koff
s-1
kon
M-1s-1
pHTemp
°C
Aurora kinase A
(Homo sapiens (Human))
BDBM31858
(2,4-Bisanilinopyrimidine, 23)
Show SMILES Oc1ccc(Nc2ncc(Cl)c(Nc3ccc(O)cc3)n2)cc1
Show InChI InChI=1S/C16H13ClN4O2/c17-14-9-18-16(20-11-3-7-13(23)8-4-11)21-15(14)19-10-1-5-12(22)6-2-10/h1-9,22-23H,(H2,18,19,20,21)
NCI pathway
Reactome pathway
n/an/a 8n/an/an/an/an/an/a
Genentech
Assay Description
Aurora kinase was assayed in ELISA format using a GST fusion of the N-terminus of Histone H3 as substrate. Plates were coated with substrate, and the...
J Med Chem 52: 3300-7 (2009)
Article DOI: 10.1021/jm9000314
BindingDB Entry DOI: 10.7270/Q2M90706