BDBM31859 2,4-Bisanilinopyrimidine, 24
SMILES: Oc1ccc(Nc2ncc(c(Nc3ccc(O)cc3)n2)C(F)(F)F)cc1
InChI Key: InChIKey=YPKCSJRUMZSEIB-UHFFFAOYSA-N
Data: 1 IC50
Activity Spreadsheet -- Enzyme Inhibition Constant Data from BindingDB
Found 1 hit for monomerid = 31859
Trg + Lig
Ki
nM
ΔG°
kcal/mole
IC50
nM
Kd
nM
EC50/IC50
nM
koff
s-1
kon
M-1s-1
pHTemp
°C
Aurora kinase A
(Homo sapiens (Human))
BDBM31859
(2,4-Bisanilinopyrimidine, 24)
Show SMILES Oc1ccc(Nc2ncc(c(Nc3ccc(O)cc3)n2)C(F)(F)F)cc1
Show InChI InChI=1S/C17H13F3N4O2/c18-17(19,20)14-9-21-16(23-11-3-7-13(26)8-4-11)24-15(14)22-10-1-5-12(25)6-2-10/h1-9,25-26H,(H2,21,22,23,24)
NCI pathway
Reactome pathway
n/an/a 14n/an/an/an/an/an/a
Genentech
Assay Description
Aurora kinase was assayed in ELISA format using a GST fusion of the N-terminus of Histone H3 as substrate. Plates were coated with substrate, and the...
J Med Chem 52: 3300-7 (2009)
Article DOI: 10.1021/jm9000314
BindingDB Entry DOI: 10.7270/Q2M90706