BDBM31860 2,4-Bisanilinopyrimidine, 25
SMILES: Oc1ccc(Nc2ncc(C#N)c(Nc3ccc(O)cc3)n2)cc1
InChI Key: InChIKey=BBZNLRUQIPMLSS-UHFFFAOYSA-N
Data: 1 IC50
Activity Spreadsheet -- Enzyme Inhibition Constant Data from BindingDB
Found 1 hit for monomerid = 31860
Trg + Lig
Ki
nM
ΔG°
kcal/mole
IC50
nM
Kd
nM
EC50/IC50
nM
koff
s-1
kon
M-1s-1
pHTemp
°C
Aurora kinase A
(Homo sapiens (Human))
BDBM31860
(2,4-Bisanilinopyrimidine, 25)
Show SMILES Oc1ccc(Nc2ncc(C#N)c(Nc3ccc(O)cc3)n2)cc1
Show InChI InChI=1S/C17H13N5O2/c18-9-11-10-19-17(21-13-3-7-15(24)8-4-13)22-16(11)20-12-1-5-14(23)6-2-12/h1-8,10,23-24H,(H2,19,20,21,22)
NCI pathway
Reactome pathway
n/an/a 23n/an/an/an/an/an/a
Genentech
Assay Description
Aurora kinase was assayed in ELISA format using a GST fusion of the N-terminus of Histone H3 as substrate. Plates were coated with substrate, and the...
J Med Chem 52: 3300-7 (2009)
Article DOI: 10.1021/jm9000314
BindingDB Entry DOI: 10.7270/Q2M90706