null
SMILES: Cn1cc2NC(=O)c3cccc(Cn4nc(OCCCNC(=O)c2n1)ccc4=O)c3
InChI Key: InChIKey=GKSLYGBWVIREPH-UHFFFAOYSA-N
Activity Spreadsheet -- Enzyme Inhibition Constant Data from BindingDB
Found 4 hits for monomerid = 318823
Trg + Lig
Ki
nM
ΔG°
kcal/mole
IC50
nM
Kd
nM
EC50/IC50
nM
koff
s-1
kon
M-1s-1
pHTemp
°C
Interleukin-1 receptor-associated kinase 4
(Homo sapiens (Human))
BDBM318823
(US10517872, Compound 1 | US9624246, Compound 1)
Show SMILES Cn1cc2NC(=O)c3cccc(Cn4nc(OCCCNC(=O)c2n1)ccc4=O)c3
Show InChI InChI=1S/C20H20N6O4/c1-25-12-15-18(24-25)20(29)21-8-3-9-30-16-6-7-17(27)26(23-16)11-13-4-2-5-14(10-13)19(28)22-15/h2,4-7,10,12H,3,8-9,11H2,1H3,(H,21,29)(H,22,28)
Reactome pathway
US Patent
n/an/a 550n/an/an/an/an/an/a
Merck Patent GmbH
US Patent
Assay Description
IRAK4 is a human purified recombinant enzyme (His-TEV-IRAK4 (1-460)). In this assay, IRAK4 hydrolyses ATP, autophosphorylates and phosphorylates a Se...
US Patent US9624246 (2017)
BindingDB Entry DOI: 10.7270/Q2DF6T92
Interleukin-1 receptor-associated kinase 4
(Homo sapiens (Human))
BDBM318823
(US10517872, Compound 1 | US9624246, Compound 1)
Show SMILES Cn1cc2NC(=O)c3cccc(Cn4nc(OCCCNC(=O)c2n1)ccc4=O)c3
Show InChI InChI=1S/C20H20N6O4/c1-25-12-15-18(24-25)20(29)21-8-3-9-30-16-6-7-17(27)26(23-16)11-13-4-2-5-14(10-13)19(28)22-15/h2,4-7,10,12H,3,8-9,11H2,1H3,(H,21,29)(H,22,28)
Reactome pathway
US Patent
n/an/a<100n/an/an/an/an/an/a
Merck Patent GmbH
US Patent
Assay Description
IRAK4 is a human purified recombinant enzyme (His-TEV-IRAK4 (1-460)).In this assay, IRAK4 hydrolyses ATP, autophosphorylates and phosphorylates a Ser...
US Patent US10517872 (2019)
BindingDB Entry DOI: 10.7270/Q2SN0CCS
Interleukin-1 receptor-associated kinase 1 [194-712]
(Homo sapiens (Human))
BDBM318823
(US10517872, Compound 1 | US9624246, Compound 1)
Show SMILES Cn1cc2NC(=O)c3cccc(Cn4nc(OCCCNC(=O)c2n1)ccc4=O)c3
Show InChI InChI=1S/C20H20N6O4/c1-25-12-15-18(24-25)20(29)21-8-3-9-30-16-6-7-17(27)26(23-16)11-13-4-2-5-14(10-13)19(28)22-15/h2,4-7,10,12H,3,8-9,11H2,1H3,(H,21,29)(H,22,28)
US Patent
n/an/a 550n/an/an/an/an/an/a
Merck Patent GmbH
US Patent
Assay Description
IRAK1 is a human purified recombinant enzyme (His-TEV-IRAK1 (194-712))In this assay, IRAK1 hydrolyses ATP and autophosphorylates. Measurement of IRAK...
US Patent US10517872 (2019)
BindingDB Entry DOI: 10.7270/Q2SN0CCS
Interleukin-1 receptor-associated kinase 1 [194-712]
(Homo sapiens (Human))
BDBM318823
(US10517872, Compound 1 | US9624246, Compound 1)
Show SMILES Cn1cc2NC(=O)c3cccc(Cn4nc(OCCCNC(=O)c2n1)ccc4=O)c3
Show InChI InChI=1S/C20H20N6O4/c1-25-12-15-18(24-25)20(29)21-8-3-9-30-16-6-7-17(27)26(23-16)11-13-4-2-5-14(10-13)19(28)22-15/h2,4-7,10,12H,3,8-9,11H2,1H3,(H,21,29)(H,22,28)
US Patent
n/an/a<100n/an/an/an/an/an/a
Merck Patent GmbH
US Patent
Assay Description
IRAK1 is a human purified recombinant enzyme (His-TEV-IRAK1 (194-712)) In this assay, IRAK1 hydrolyses ATP and autophosphorylates. Measurement of IRA...
US Patent US9624246 (2017)
BindingDB Entry DOI: 10.7270/Q2DF6T92