null
SMILES: Cn1cc2NC(=O)c3cccc(Cn4nc(ccc4=O)-c4cnn(CCNC(=O)c2n1)c4)c3
InChI Key: InChIKey=WGAIHKWWBXYAKM-UHFFFAOYSA-N
Activity Spreadsheet -- Enzyme Inhibition Constant Data from BindingDB
Found 4 hits for monomerid = 318825
Trg + Lig
Ki
nM
ΔG°
kcal/mole
IC50
nM
Kd
nM
EC50/IC50
nM
koff
s-1
kon
M-1s-1
pHTemp
°C
Interleukin-1 receptor-associated kinase 4
(Homo sapiens (Human))
BDBM318825
(US10517872, Compound 2 | US9624246, Compound 2)
Show SMILES Cn1cc2NC(=O)c3cccc(Cn4nc(ccc4=O)-c4cnn(CCNC(=O)c2n1)c4)c3
Show InChI InChI=1S/C22H20N8O3/c1-28-13-18-20(27-28)22(33)23-7-8-29-12-16(10-24-29)17-5-6-19(31)30(26-17)11-14-3-2-4-15(9-14)21(32)25-18/h2-6,9-10,12-13H,7-8,11H2,1H3,(H,23,33)(H,25,32)
Reactome pathway
US Patent
n/an/a<100n/an/an/an/an/an/a
Merck Patent GmbH
US Patent
Assay Description
IRAK4 is a human purified recombinant enzyme (His-TEV-IRAK4 (1-460)). In this assay, IRAK4 hydrolyses ATP, autophosphorylates and phosphorylates a Se...
US Patent US9624246 (2017)
BindingDB Entry DOI: 10.7270/Q2DF6T92
Interleukin-1 receptor-associated kinase 4
(Homo sapiens (Human))
BDBM318825
(US10517872, Compound 2 | US9624246, Compound 2)
Show SMILES Cn1cc2NC(=O)c3cccc(Cn4nc(ccc4=O)-c4cnn(CCNC(=O)c2n1)c4)c3
Show InChI InChI=1S/C22H20N8O3/c1-28-13-18-20(27-28)22(33)23-7-8-29-12-16(10-24-29)17-5-6-19(31)30(26-17)11-14-3-2-4-15(9-14)21(32)25-18/h2-6,9-10,12-13H,7-8,11H2,1H3,(H,23,33)(H,25,32)
Reactome pathway
US Patent
n/an/a<100n/an/an/an/an/an/a
Merck Patent GmbH
US Patent
Assay Description
IRAK4 is a human purified recombinant enzyme (His-TEV-IRAK4 (1-460)).In this assay, IRAK4 hydrolyses ATP, autophosphorylates and phosphorylates a Ser...
US Patent US10517872 (2019)
BindingDB Entry DOI: 10.7270/Q2SN0CCS
Interleukin-1 receptor-associated kinase 1 [194-712]
(Homo sapiens (Human))
BDBM318825
(US10517872, Compound 2 | US9624246, Compound 2)
Show SMILES Cn1cc2NC(=O)c3cccc(Cn4nc(ccc4=O)-c4cnn(CCNC(=O)c2n1)c4)c3
Show InChI InChI=1S/C22H20N8O3/c1-28-13-18-20(27-28)22(33)23-7-8-29-12-16(10-24-29)17-5-6-19(31)30(26-17)11-14-3-2-4-15(9-14)21(32)25-18/h2-6,9-10,12-13H,7-8,11H2,1H3,(H,23,33)(H,25,32)
US Patent
n/an/a<100n/an/an/an/an/an/a
Merck Patent GmbH
US Patent
Assay Description
IRAK1 is a human purified recombinant enzyme (His-TEV-IRAK1 (194-712))In this assay, IRAK1 hydrolyses ATP and autophosphorylates. Measurement of IRAK...
US Patent US10517872 (2019)
BindingDB Entry DOI: 10.7270/Q2SN0CCS
Interleukin-1 receptor-associated kinase 1 [194-712]
(Homo sapiens (Human))
BDBM318825
(US10517872, Compound 2 | US9624246, Compound 2)
Show SMILES Cn1cc2NC(=O)c3cccc(Cn4nc(ccc4=O)-c4cnn(CCNC(=O)c2n1)c4)c3
Show InChI InChI=1S/C22H20N8O3/c1-28-13-18-20(27-28)22(33)23-7-8-29-12-16(10-24-29)17-5-6-19(31)30(26-17)11-14-3-2-4-15(9-14)21(32)25-18/h2-6,9-10,12-13H,7-8,11H2,1H3,(H,23,33)(H,25,32)
US Patent
n/an/a<100n/an/an/an/an/an/a
Merck Patent GmbH
US Patent
Assay Description
IRAK1 is a human purified recombinant enzyme (His-TEV-IRAK1 (194-712)) In this assay, IRAK1 hydrolyses ATP and autophosphorylates. Measurement of IRA...
US Patent US9624246 (2017)
BindingDB Entry DOI: 10.7270/Q2DF6T92