null
SMILES: CC(c1ccccc1)n1cnc(c1)-c1cc(ccn1)-c1nn[nH]c1C(F)(F)F
InChI Key:
Activity Spreadsheet -- Enzyme Inhibition Constant Data from BindingDB
Found 8 hits for monomerid = 319654
Trg + Lig
Ki
nM
ΔG°
kcal/mole
IC50
nM
Kd
nM
EC50/IC50
nM
koff
s-1
kon
M-1s-1
pHTemp
°C
Lysine-specific demethylase 2B
(Homo sapiens (Human))
BDBM319654
(2-[1-(1-phenylethyl)-1H-imidazol-4-yl]-4-[5- (trif...)
Show SMILES CC(c1ccccc1)n1cnc(c1)-c1cc(ccn1)-c1nn[nH]c1C(F)(F)F
US Patent
n/an/a<100n/an/an/an/an/an/a
Celgene Quanticel Research, Inc.
US Patent
Assay Description
The ability of test compounds to inhibit the activity of FBXL10 was determined in 384-well plate format under the following reaction conditions: 0.3 ...
US Patent US10174003 (2019)
BindingDB Entry DOI: 10.7270/Q2417053
Lysine-specific demethylase 5B
(Homo sapiens (Human))
BDBM319654
(2-[1-(1-phenylethyl)-1H-imidazol-4-yl]-4-[5- (trif...)
Show SMILES CC(c1ccccc1)n1cnc(c1)-c1cc(ccn1)-c1nn[nH]c1C(F)(F)F
US Patent
n/an/a 550n/an/an/an/an/an/a
Celgene Quanticel Research, Inc.
US Patent
Assay Description
The ability of test compounds to inhibit the activity of Jarid1B was determined in 384-well plate format under the following reaction conditions: 0.8...
US Patent US10174003 (2019)
BindingDB Entry DOI: 10.7270/Q2417053
Lysine-specific demethylase 4C
(Homo sapiens (Human))
BDBM319654
(2-[1-(1-phenylethyl)-1H-imidazol-4-yl]-4-[5- (trif...)
Show SMILES CC(c1ccccc1)n1cnc(c1)-c1cc(ccn1)-c1nn[nH]c1C(F)(F)F
US Patent
n/an/a>1.00E+4n/an/an/an/an/an/a
Celgene Quanticel Research, Inc.
US Patent
Assay Description
The ability of test compounds to inhibit the activity of JMJD2C was determined in 384-well plate format under the following reaction conditions: 0.3 ...
US Patent US10174003 (2019)
BindingDB Entry DOI: 10.7270/Q2417053
Lysine-specific demethylase 6B
(Homo sapiens (Human))
BDBM319654
(2-[1-(1-phenylethyl)-1H-imidazol-4-yl]-4-[5- (trif...)
Show SMILES CC(c1ccccc1)n1cnc(c1)-c1cc(ccn1)-c1nn[nH]c1C(F)(F)F
US Patent
n/an/a>1.00E+4n/an/an/an/an/an/a
GSK
Assay Description
The ability of test compounds to inhibit the activity of JMJD3 was determined in 384-well plate format under the following reaction conditions: 1 nM ...
Bioorg Med Chem Lett 17: 1584-9 (2007)
BindingDB Entry DOI: 10.7270/Q2FT8PBQ
Lysine-specific demethylase 2B
(Homo sapiens (Human))
BDBM319654
(2-[1-(1-phenylethyl)-1H-imidazol-4-yl]-4-[5- (trif...)
Show SMILES CC(c1ccccc1)n1cnc(c1)-c1cc(ccn1)-c1nn[nH]c1C(F)(F)F
US Patent
n/an/a<100n/an/an/an/an/an/a
GSK
Assay Description
The ability of test compounds to inhibit the activity of FBXL10 was determined in 384-well plate format under the following reaction conditions: 0.3 ...
Bioorg Med Chem Lett 17: 1584-9 (2007)
BindingDB Entry DOI: 10.7270/Q2FT8PBQ
Lysine-specific demethylase 5B
(Homo sapiens (Human))
BDBM319654
(2-[1-(1-phenylethyl)-1H-imidazol-4-yl]-4-[5- (trif...)
Show SMILES CC(c1ccccc1)n1cnc(c1)-c1cc(ccn1)-c1nn[nH]c1C(F)(F)F
US Patent
n/an/a 300n/an/an/an/an/an/a
GSK
Assay Description
The ability of test compounds to inhibit the activity of Jarid1B was determined in 384-well plate format under the following reaction conditions: 0.8...
Bioorg Med Chem Lett 17: 1584-9 (2007)
BindingDB Entry DOI: 10.7270/Q2FT8PBQ
Lysine-specific demethylase 4C
(Homo sapiens (Human))
BDBM319654
(2-[1-(1-phenylethyl)-1H-imidazol-4-yl]-4-[5- (trif...)
Show SMILES CC(c1ccccc1)n1cnc(c1)-c1cc(ccn1)-c1nn[nH]c1C(F)(F)F
US Patent
n/an/a>1.00E+4n/an/an/an/an/an/a
GSK
Assay Description
The ability of test compounds to inhibit the activity of JMJD2C was determined in 384-well plate format under the following reaction conditions: 0.3 ...
Bioorg Med Chem Lett 17: 1584-9 (2007)
BindingDB Entry DOI: 10.7270/Q2FT8PBQ
Lysine-specific demethylase 6B
(Homo sapiens (Human))
BDBM319654
(2-[1-(1-phenylethyl)-1H-imidazol-4-yl]-4-[5- (trif...)
Show SMILES CC(c1ccccc1)n1cnc(c1)-c1cc(ccn1)-c1nn[nH]c1C(F)(F)F
US Patent
n/an/a>1.00E+4n/an/an/an/an/an/a
Celgene Quanticel Research, Inc.
US Patent
Assay Description
The ability of test compounds to inhibit the activity of JMJD3 was determined in 384-well plate format under the following reaction conditions: 1 nM ...
US Patent US10174003 (2019)
BindingDB Entry DOI: 10.7270/Q2417053