BDBM319664 2-{1-[(2,3-dihydro-1H-inden-1-yl)methyl]-1H- imidazol-4-yl}-4-[5-(trifluoromethyl)-1H-1,2,3- triazol-4-yl]pyridine::US10174003, Example 83::US9896436, Example 83
SMILES: FC(F)(F)c1[nH]nnc1-c1ccnc(c1)-c1cn(CC2CCc3ccccc23)cn1
InChI Key:
Data: 6 IC50
Activity Spreadsheet -- Enzyme Inhibition Constant Data from BindingDB
Found 6 hits for monomerid = 319664
Trg + Lig
Ki
nM
ΔG°
kcal/mole
IC50
nM
Kd
nM
EC50/IC50
nM
koff
s-1
kon
M-1s-1
pHTemp
°C
Lysine-specific demethylase 2B
(Homo sapiens (Human))
BDBM319664
(2-{1-[(2,3-dihydro-1H-inden-1-yl)methyl]-1H- imida...)
Show SMILES FC(F)(F)c1[nH]nnc1-c1ccnc(c1)-c1cn(CC2CCc3ccccc23)cn1
US Patent
n/an/a 550n/an/an/an/an/an/a
Celgene Quanticel Research, Inc.
US Patent
Assay Description
The ability of test compounds to inhibit the activity of FBXL10 was determined in 384-well plate format under the following reaction conditions: 0.3 ...
US Patent US10174003 (2019)
BindingDB Entry DOI: 10.7270/Q2417053
Lysine-specific demethylase 5B
(Homo sapiens (Human))
BDBM319664
(2-{1-[(2,3-dihydro-1H-inden-1-yl)methyl]-1H- imida...)
Show SMILES FC(F)(F)c1[nH]nnc1-c1ccnc(c1)-c1cn(CC2CCc3ccccc23)cn1
US Patent
n/an/a<100n/an/an/an/an/an/a
Celgene Quanticel Research, Inc.
US Patent
Assay Description
The ability of test compounds to inhibit the activity of Jarid1B was determined in 384-well plate format under the following reaction conditions: 0.8...
US Patent US10174003 (2019)
BindingDB Entry DOI: 10.7270/Q2417053
Lysine-specific demethylase 4C
(Homo sapiens (Human))
BDBM319664
(2-{1-[(2,3-dihydro-1H-inden-1-yl)methyl]-1H- imida...)
Show SMILES FC(F)(F)c1[nH]nnc1-c1ccnc(c1)-c1cn(CC2CCc3ccccc23)cn1
US Patent
n/an/a>500n/an/an/an/an/an/a
GSK
Assay Description
The ability of test compounds to inhibit the activity of JMJD2C was determined in 384-well plate format under the following reaction conditions: 0.3 ...
Bioorg Med Chem Lett 17: 1584-9 (2007)
BindingDB Entry DOI: 10.7270/Q2FT8PBQ
Lysine-specific demethylase 2B
(Homo sapiens (Human))
BDBM319664
(2-{1-[(2,3-dihydro-1H-inden-1-yl)methyl]-1H- imida...)
Show SMILES FC(F)(F)c1[nH]nnc1-c1ccnc(c1)-c1cn(CC2CCc3ccccc23)cn1
US Patent
n/an/a 300n/an/an/an/an/an/a
GSK
Assay Description
The ability of test compounds to inhibit the activity of FBXL10 was determined in 384-well plate format under the following reaction conditions: 0.3 ...
Bioorg Med Chem Lett 17: 1584-9 (2007)
BindingDB Entry DOI: 10.7270/Q2FT8PBQ
Lysine-specific demethylase 5B
(Homo sapiens (Human))
BDBM319664
(2-{1-[(2,3-dihydro-1H-inden-1-yl)methyl]-1H- imida...)
Show SMILES FC(F)(F)c1[nH]nnc1-c1ccnc(c1)-c1cn(CC2CCc3ccccc23)cn1
US Patent
n/an/a<100n/an/an/an/an/an/a
GSK
Assay Description
The ability of test compounds to inhibit the activity of Jarid1B was determined in 384-well plate format under the following reaction conditions: 0.8...
Bioorg Med Chem Lett 17: 1584-9 (2007)
BindingDB Entry DOI: 10.7270/Q2FT8PBQ
Lysine-specific demethylase 4C
(Homo sapiens (Human))
BDBM319664
(2-{1-[(2,3-dihydro-1H-inden-1-yl)methyl]-1H- imida...)
Show SMILES FC(F)(F)c1[nH]nnc1-c1ccnc(c1)-c1cn(CC2CCc3ccccc23)cn1
US Patent
n/an/a 5.50E+3n/an/an/an/an/an/a
Celgene Quanticel Research, Inc.
US Patent
Assay Description
The ability of test compounds to inhibit the activity of JMJD2C was determined in 384-well plate format under the following reaction conditions: 0.3 ...
US Patent US10174003 (2019)
BindingDB Entry DOI: 10.7270/Q2417053