BDBM319692 7-(2-(4-(2-fluorobenzo[b]thiophen-4-yl)piperazin-1-yl)ethyl)quinolin-2(1H)-onehydrochloride::US10174011, Example 57
SMILES: Fc1cc2c(cccc2s1)N1CCN(CCc2ccc3ccc(=O)[nH]c3c2)CC1
InChI Key: InChIKey=IMICGKCVFIYIAJ-UHFFFAOYSA-N
Data: 3 IC50  1 EC50
Activity Spreadsheet -- Enzyme Inhibition Constant Data from BindingDB
Found 4 hits for monomerid = 319692
Trg + Lig
Ki
nM
ΔG°
kcal/mole
IC50
nM
Kd
nM
EC50/IC50
nM
koff
s-1
kon
M-1s-1
pHTemp
°C
5-hydroxytryptamine receptor 1A
(Homo sapiens (Human))
BDBM319692
(7-(2-(4-(2-fluorobenzo[b]thiophen-4-yl)piperazin-1...)
Show SMILES Fc1cc2c(cccc2s1)N1CCN(CCc2ccc3ccc(=O)[nH]c3c2)CC1
Show InChI InChI=1S/C23H22FN3OS/c24-22-15-18-20(2-1-3-21(18)29-22)27-12-10-26(11-13-27)9-8-16-4-5-17-6-7-23(28)25-19(17)14-16/h1-7,14-15H,8-13H2,(H,25,28)
US Patent
n/an/an/an/a 4.51n/an/an/an/a
SHANGHAI INSTITUTE OF MATERIA MEDICA, CHINESE ACADEMY OF SCIENCES; SUZHOU VIGONVITA LIFE SCIENCES CO., LTD.; TOPHARMAN SHANDONG CO., LTD.
US Patent
Assay Description
The 5-HT1A receptor agonism activity test (The agonism activity of test compounds on 5-HT1A receptor expressing human recombinant 5-HT1A receptor in ...
US Patent US10174011 (2019)
BindingDB Entry DOI: 10.7270/Q2VH5QX7
D(2) dopamine receptor
(Homo sapiens (Human))
BDBM319692
(7-(2-(4-(2-fluorobenzo[b]thiophen-4-yl)piperazin-1...)
Show SMILES Fc1cc2c(cccc2s1)N1CCN(CCc2ccc3ccc(=O)[nH]c3c2)CC1
Show InChI InChI=1S/C23H22FN3OS/c24-22-15-18-20(2-1-3-21(18)29-22)27-12-10-26(11-13-27)9-8-16-4-5-17-6-7-23(28)25-19(17)14-16/h1-7,14-15H,8-13H2,(H,25,28)
Reactome pathway
US Patent
n/an/a 0.480n/an/an/an/an/an/a
SHANGHAI INSTITUTE OF MATERIA MEDICA, CHINESE ACADEMY OF SCIENCES; SUZHOU VIGONVITA LIFE SCIENCES CO., LTD.; TOPHARMAN SHANDONG CO., LTD.
US Patent
Assay Description
The D2 receptor agonism activity test (The agonism activity of test compounds on D2 receptor expressing human recombinant D2 receptor in HEK293 cells...
US Patent US10174011 (2019)
BindingDB Entry DOI: 10.7270/Q2VH5QX7
5-hydroxytryptamine receptor 2A
(Homo sapiens (Human))
BDBM319692
(7-(2-(4-(2-fluorobenzo[b]thiophen-4-yl)piperazin-1...)
Show SMILES Fc1cc2c(cccc2s1)N1CCN(CCc2ccc3ccc(=O)[nH]c3c2)CC1
Show InChI InChI=1S/C23H22FN3OS/c24-22-15-18-20(2-1-3-21(18)29-22)27-12-10-26(11-13-27)9-8-16-4-5-17-6-7-23(28)25-19(17)14-16/h1-7,14-15H,8-13H2,(H,25,28)
Reactome pathway
US Patent
n/an/a 368n/an/an/an/an/an/a
SHANGHAI INSTITUTE OF MATERIA MEDICA, CHINESE ACADEMY OF SCIENCES; SUZHOU VIGONVITA LIFE SCIENCES CO., LTD.; TOPHARMAN SHANDONG CO., LTD.
US Patent
Assay Description
The 5-HT2A receptor antagonism activity test (The antagonism activity of test compounds on 5-HT2A receptor expressing human recombinant 5-HT2A recept...
US Patent US10174011 (2019)
BindingDB Entry DOI: 10.7270/Q2VH5QX7
D(2) dopamine receptor
(Homo sapiens (Human))
BDBM319692
(7-(2-(4-(2-fluorobenzo[b]thiophen-4-yl)piperazin-1...)
Show SMILES Fc1cc2c(cccc2s1)N1CCN(CCc2ccc3ccc(=O)[nH]c3c2)CC1
Show InChI InChI=1S/C23H22FN3OS/c24-22-15-18-20(2-1-3-21(18)29-22)27-12-10-26(11-13-27)9-8-16-4-5-17-6-7-23(28)25-19(17)14-16/h1-7,14-15H,8-13H2,(H,25,28)
Reactome pathway
US Patent
n/an/a 8.40n/an/an/an/an/an/a
SHANGHAI INSTITUTE OF MATERIA MEDICA, CHINESE ACADEMY OF SCIENCES; SUZHOU VIGONVITA LIFE SCIENCES CO., LTD.; TOPHARMAN SHANDONG CO., LTD.
US Patent
Assay Description
The D2 receptor antagonism activity test (The antagonism activity of test compounds on D2 receptor expressing human recombinant D2 receptor in HEK293...
US Patent US10174011 (2019)
BindingDB Entry DOI: 10.7270/Q2VH5QX7